program: Orca
programVersion: 5.0.2
elementType: O O C C C C C C C C C C C C C C C C C C H H H H H H H H H H H H H H H H H H H H H H H H H H H H
charge: 0
multiplicity: 1
keywords: wb97x-d3
keywords: def2-TZVPP
keywords: def2/J RIJCOSX
keywords: DEFGRID2
keywords: scfconv7
keywords: smallprint printgap noloewdin
keywords: NOSOSCF
formula: C18H28O2
InChI: InChI=1/C18H28O2/c1-6-13-20-18(19)14-17(5)12-8-11-16(4)10-7-9-15(2)3/h1,8,12,14-16H,7,9-11,13H2,2-5H3
48 atoms
O  3.390095 -0.984509 -0.929315
O  3.203267 -2.515492 0.689842
C  -3.76595 -0.237752 -0.571868
C  -3.232626 1.071571 0.020011
C  -2.977083 2.157533 -1.018449
C  -2.431099 3.459443 -0.437576
C  -1.104068 3.354783 0.319809
C  -3.626475 -1.396287 0.415124
C  -5.223472 -0.101272 -1.002561
C  -0.001059 2.730815 -0.528564
C  -0.680494 4.731528 0.820877
C  -2.24375 -1.873632 0.728287
C  -1.112678 -1.501219 0.123304
C  0.225215 -1.984818 0.456001
C  0.346959 -3.030184 1.520056
C  1.25393 -1.436769 -0.221393
C  2.681839 -1.735593 -0.062649
C  4.799963 -1.133114 -0.903313
C  5.418616 -0.397866 0.191792
C  5.953351 0.222709 1.06715
H  -3.179363 -0.479095 -1.467166
H  -3.944617 1.438851 0.769057
H  -2.308074 0.872567 0.566518
H  -2.28991 1.772696 -1.779239
H  -3.903424 2.386073 -1.552743
H  -3.182569 3.891325 0.232524
H  -2.308461 4.181287 -1.252927
H  -1.253945 2.717404 1.198206
H  -4.194124 -2.260187 0.046886
H  -4.118656 -1.126801 1.357946
H  -5.584477 -1.011957 -1.482989
H  -5.867245 0.096143 -0.142247
H  -5.363091 0.714979 -1.711035
H  0.158815 3.300416 -1.447301
H  -0.231999 1.703099 -0.813242
H  0.945552 2.705227 0.012675
H  -1.450848 5.183569 1.4480
H  0.235171 4.67661 1.411342
H  -0.494359 5.412466 -0.012943
H  -2.193563 -2.606697 1.52756
H  -1.1550 -0.767625 -0.675433
H  1.370288 -3.341425 1.687416
H  -0.243028 -3.908263 1.251457
H  -0.054292 -2.652573 2.462529
H  1.028671 -0.682359 -0.966178
H  5.151275 -0.735697 -1.85616
H  5.086734 -2.1860 -0.84964
H  6.421192 0.762174 1.85466
totalener: -853.22765146 hartree
nucrepener: 1511.76187264 hartree
electener: -2364.98952410 hartree
oneelecener: -4157.63226491 hartree
twoeener: 1792.64274081 hartree
kineticenergy: 849.18237499 hartree
xcener: -85.613844750392 hartree
chargesum: 0.0000000
charge: -0.261803 -0.382700 0.086118 -0.221127 -0.114064 -0.185728 0.052339 -0.123364 -0.278213 -0.251379 -0.269119 -0.109375 -0.098666 0.029012 -0.274273 -0.152222 0.409969 -0.013030 -0.364639 0.068761 0.036966 0.077060 0.092824 0.067118 0.079626 0.071087 0.074199 0.035657 0.083002 0.077855 0.084378 0.079049 0.086631 0.083801 0.040353 0.091527 0.080705 0.083921 0.076080 0.099612 0.067305 0.123848 0.091841 0.090252 0.097466 0.115506 0.125961 0.239874
qa: -0.2618 -0.3827 0.0861 -0.2211 -0.1141 -0.1857 0.0523 -0.1234 -0.2782 -0.2514 -0.2691 -0.1094 -0.0987 0.0290 -0.2743 -0.1522 0.4100 -0.0130 -0.3646 0.0688 0.0370 0.0771 0.0928 0.0671 0.0796 0.0711 0.0742 0.0357 0.0830 0.0779 0.0844 0.0790 0.0866 0.0838 0.0404 0.0915 0.0807 0.0839 0.0761 0.0996 0.0673 0.1238 0.0918 0.0903 0.0975 0.1155 0.1260 0.2399
va: 2.1298 2.1207 3.7765 3.8766 3.8546 3.9224 3.8182 3.9781 3.9448 3.9406 3.9440 3.9153 3.9082 3.6439 3.9285 3.7850 4.2367 3.9862 3.7916 3.6837 1.0175 1.0171 0.9984 1.0055 1.0186 1.0112 1.0128 1.0134 1.0058 1.0059 1.0067 1.0049 1.0074 1.0072 1.0132 1.0105 1.0067 1.0071 1.0064 1.0103 1.0280 1.0383 0.9970 0.9971 1.0306 0.9852 1.0015 0.9745
dispcorr: -0.020738037 hartree
energy: -853.248389495976
dipole: -31.13394 30.24884 -0.88510 18.85483 -18.60776 0.24707 -0.83949 0.61925 -0.22025
magnitude: 0.94497 au
magnitude: 2.40192 debye
