program: Orca
programVersion: 5.0.2
elementType: O O C C C C C C C C C C C C C C C C C C H H H H H H H H H H H H H H H H H H H H H H H H H H H H
charge: 0
multiplicity: 1
keywords: wb97x-d3
keywords: def2-TZVPP
keywords: def2/J RIJCOSX
keywords: DEFGRID2
keywords: scfconv7
keywords: smallprint printgap noloewdin
keywords: NOSOSCF
formula: C18H28O2
InChI: InChI=1/C18H28O2/c1-6-13-20-18(19)14-17(5)12-8-11-16(4)10-7-9-15(2)3/h1,8,12,14-16H,7,9-11,13H2,2-5H3
48 atoms
O  3.578986 -1.460961 1.275981
O  3.216508 -2.101665 -0.835764
C  -4.300182 -0.193344 -0.278112
C  -3.497214 1.073617 -0.592911
C  -2.965035 1.834973 0.615595
C  -2.343829 3.184324 0.258911
C  -1.173411 3.14859 -0.726788
C  -3.493864 -1.222409 0.529374
C  -5.619444 0.110252 0.424596
C  -0.67994 4.565838 -0.999139
C  -0.030523 2.267426 -0.234307
C  -2.198545 -1.584199 -0.114527
C  -1.004841 -1.448297 0.468589
C  0.286534 -1.756605 -0.13936
C  0.288174 -2.281366 -1.54062
C  1.381799 -1.527668 0.611804
C  2.781927 -1.73742 0.224808
C  4.976372 -1.581985 1.067238
C  5.533355 -0.439732 0.354704
C  6.013918 0.504984 -0.205569
H  -4.542801 -0.657439 -1.241963
H  -2.660292 0.804794 -1.244399
H  -4.130733 1.742554 -1.186021
H  -3.774615 2.01702 1.328197
H  -2.232289 1.223059 1.148881
H  -2.005782 3.670073 1.181237
H  -3.126049 3.833184 -0.150524
H  -1.532869 2.73763 -1.677057
H  -4.104831 -2.126032 0.636779
H  -3.317089 -0.853583 1.543729
H  -5.464415 0.534775 1.417726
H  -6.217118 0.821117 -0.147657
H  -6.216117 -0.794696 0.550232
H  -0.2920 5.028059 -0.088462
H  -1.480708 5.204194 -1.376506
H  0.122927 4.572196 -1.737803
H  0.339639 2.610736 0.735107
H  -0.327852 1.224055 -0.123552
H  0.810419 2.287129 -0.929063
H  -2.263191 -1.966059 -1.129843
H  -0.971443 -1.062801 1.484074
H  -0.316428 -3.187869 -1.603027
H  1.283084 -2.504411 -1.9044
H  -0.164942 -1.549569 -2.212338
H  1.240063 -1.145144 1.615675
H  5.219537 -2.504482 0.534617
H  5.414326 -1.642497 2.064129
H  6.433083 1.337884 -0.716328
totalener: -853.22890249 hartree
nucrepener: 1523.29884762 hartree
electener: -2376.52775011 hartree
oneelecener: -4180.76564028 hartree
twoeener: 1804.23789017 hartree
kineticenergy: 849.19012818 hartree
xcener: -85.615049952269 hartree
chargesum: -0.0000000
charge: -0.261517 -0.382033 0.039287 -0.140019 -0.138544 -0.191008 0.054074 -0.139468 -0.293218 -0.269745 -0.234368 -0.093580 -0.139103 0.032362 -0.264802 -0.165834 0.428854 -0.012653 -0.364627 0.068508 0.051013 0.072922 0.083048 0.084588 0.064364 0.073816 0.070200 0.031711 0.093024 0.072672 0.077056 0.088609 0.086409 0.075650 0.079855 0.083197 0.080031 0.037296 0.087625 0.103618 0.087069 0.092155 0.123902 0.090826 0.095170 0.125683 0.115992 0.239933
qa: -0.2615 -0.3820 0.0393 -0.1400 -0.1385 -0.1910 0.0541 -0.1395 -0.2932 -0.2697 -0.2344 -0.0936 -0.1391 0.0324 -0.2648 -0.1658 0.4289 -0.0127 -0.3646 0.0685 0.0510 0.0729 0.0830 0.0846 0.0644 0.0738 0.0702 0.0317 0.0930 0.0727 0.0771 0.0886 0.0864 0.0757 0.0799 0.0832 0.0800 0.0373 0.0876 0.1036 0.0871 0.0922 0.1239 0.0908 0.0952 0.1257 0.1160 0.2399
va: 2.1334 2.1212 3.8364 3.8474 3.8570 3.9335 3.8390 3.9236 3.9584 3.9431 3.9304 3.8484 3.9239 3.6398 3.9227 3.7681 4.2109 3.9839 3.7916 3.6848 1.0116 1.0124 1.0088 1.0136 1.0080 1.0130 1.0113 1.0127 1.0088 1.0090 1.0029 1.0060 1.0065 1.0066 1.0070 1.0072 1.0073 1.0149 1.0123 1.0071 1.0268 0.9973 1.0387 0.9978 1.0374 1.0011 0.9853 0.9745
dispcorr: -0.021880872 hartree
energy: -853.250783359294
dipole: -32.20765 31.37374 -0.83392 18.59081 -18.51632 0.07449 -3.06783 3.37718 0.30935
magnitude: 0.89256 au
magnitude: 2.26870 debye
