program: Orca
programVersion: 5.0.2
elementType: O O C C C C C C C C C C C C C C C C C C H H H H H H H H H H H H H H H H H H H H H H H H H H H H
charge: 0
multiplicity: 1
keywords: wb97x-d3
keywords: def2-TZVPP
keywords: def2/J RIJCOSX
keywords: DEFGRID2
keywords: scfconv7
keywords: smallprint printgap noloewdin
keywords: NOSOSCF
formula: C18H28O2
InChI: InChI=1/C18H28O2/c1-6-13-20-18(19)14-17(5)12-8-11-16(4)10-7-9-15(2)3/h1,8,12,14-16H,7,9-11,13H2,2-5H3
48 atoms
O  3.428779 -0.324524 0.473641
O  3.208868 -2.539266 0.688266
C  -3.652376 -0.048746 -0.67656
C  -3.558868 0.628713 0.697489
C  -3.200254 2.113437 0.661413
C  -1.747309 2.373697 0.274583
C  -1.290932 3.827315 0.407409
C  -3.536047 -1.567993 -0.553264
C  -4.957292 0.317078 -1.377789
C  0.211985 3.931168 0.16911
C  -2.047513 4.75764 -0.534855
C  -2.192107 -2.124978 -0.202372
C  -1.040591 -1.449778 -0.160519
C  0.26741 -2.013068 0.164769
C  0.349148 -3.480108 0.446802
C  1.305572 -1.153022 0.188692
C  2.710402 -1.465779 0.47448
C  4.825344 -0.450116 0.685332
C  5.530413 -0.886026 -0.513025
C  6.129047 -1.218518 -1.497136
H  -2.832346 0.303193 -1.312024
H  -4.521367 0.499996 1.204473
H  -2.824512 0.111091 1.321563
H  -3.875641 2.645557 -0.014629
H  -3.378292 2.539901 1.653591
H  -1.564985 2.04621 -0.756152
H  -1.10555 1.750095 0.907709
H  -1.492731 4.147852 1.436734
H  -3.847432 -2.0375 -1.494889
H  -4.264019 -1.925654 0.185748
H  -4.999265 -0.098431 -2.385664
H  -5.818473 -0.06591 -0.825148
H  -5.079516 1.396885 -1.466878
H  0.567767 4.954504 0.297484
H  0.469845 3.619079 -0.845803
H  0.772362 3.298102 0.859083
H  -1.692639 5.785125 -0.441854
H  -1.907048 4.455442 -1.575687
H  -3.119214 4.766879 -0.335122
H  -2.187121 -3.188568 0.015999
H  -1.043208 -0.387342 -0.377254
H  -0.004361 -4.046919 -0.416433
H  -0.302889 -3.736702 1.283906
H  1.354011 -3.807543 0.681398
H  1.106786 -0.109289 -0.026227
H  5.042325 -1.131845 1.511029
H  5.166443 0.545644 0.970507
H  6.651624 -1.526779 -2.370169
totalener: -853.22750167 hartree
nucrepener: 1504.10215496 hartree
electener: -2357.32965663 hartree
oneelecener: -4142.27730574 hartree
twoeener: 1784.94764911 hartree
kineticenergy: 849.17868115 hartree
xcener: -85.612456408080 hartree
chargesum: 0.0000000
charge: -0.263068 -0.382348 0.059734 -0.191630 -0.124679 -0.159326 0.046628 -0.125917 -0.284071 -0.263316 -0.272661 -0.101346 -0.071020 0.001846 -0.276820 -0.133778 0.408879 -0.010972 -0.364787 0.067593 0.045427 0.084158 0.094390 0.060371 0.075490 0.063885 0.064306 0.026582 0.081053 0.077939 0.084949 0.079380 0.087792 0.084730 0.075656 0.082063 0.084185 0.077532 0.082535 0.099642 0.050011 0.093546 0.089363 0.122660 0.092540 0.125368 0.115230 0.240277
qa: -0.2631 -0.3823 0.0597 -0.1916 -0.1247 -0.1593 0.0466 -0.1259 -0.2841 -0.2633 -0.2727 -0.1013 -0.0710 0.0018 -0.2768 -0.1338 0.4089 -0.0110 -0.3648 0.0676 0.0454 0.0842 0.0944 0.0604 0.0755 0.0639 0.0643 0.0266 0.0811 0.0779 0.0849 0.0794 0.0878 0.0847 0.0757 0.0821 0.0842 0.0775 0.0825 0.0996 0.0500 0.0935 0.0894 0.1227 0.0925 0.1254 0.1152 0.2403
va: 2.1289 2.1207 3.7731 3.8977 3.8865 3.8855 3.8796 3.9742 3.9474 3.9321 3.9345 3.8965 3.8976 3.6981 3.9241 3.7769 4.2316 3.9843 3.7922 3.6851 1.0118 1.0125 1.0051 1.0127 1.0115 1.0097 1.0124 1.0169 1.0057 1.0061 1.0063 1.0057 1.0052 1.0084 1.0060 1.0087 1.0083 1.0046 1.0057 1.0104 1.0403 0.9973 0.9963 1.0386 1.0321 1.0013 0.9854 0.9743
dispcorr: -0.020472558 hartree
energy: -853.247974224535
dipole: -32.52185 31.61946 -0.90239 19.44932 -19.02344 0.42588 -2.16356 2.12960 -0.03396
magnitude: 0.99841 au
magnitude: 2.53777 debye
