program: Orca
programVersion: 5.0.2
elementType: O O C C C C C C C C C C C C C C C C C C H H H H H H H H H H H H H H H H H H H H H H H H H H H H
charge: 0
multiplicity: 1
keywords: wb97x-d3
keywords: def2-TZVPP
keywords: def2/J RIJCOSX
keywords: DEFGRID2
keywords: scfconv7
keywords: smallprint printgap noloewdin
keywords: NOSOSCF
formula: C18H28O2
InChI: InChI=1/C18H28O2/c1-6-13-20-18(19)14-17(5)12-8-11-16(4)10-7-9-15(2)3/h1,8,12,14-16H,7,9-11,13H2,2-5H3
48 atoms
O  3.882918 -2.788409 0.639654
O  3.847709 -0.558535 0.786052
C  -3.652673 -0.648708 -0.971263
C  -3.475031 0.831988 -1.321186
C  -4.108502 1.824786 -0.348567
C  -3.67754 3.268867 -0.601674
C  -2.229701 3.602165 -0.225953
C  -3.02789 -1.030467 0.384124
C  -5.113198 -1.083632 -1.014274
C  -1.858423 4.989521 -0.739161
C  -1.993435 3.517259 1.279242
C  -1.623996 -0.553217 0.543069
C  -0.543906 -1.337286 0.510116
C  0.836711 -0.87426 0.629163
C  1.063293 0.598629 0.772235
C  1.802606 -1.813808 0.596914
C  3.251663 -1.598199 0.684933
C  5.300822 -2.756537 0.66166
C  5.868438 -2.396569 -0.631433
C  6.351967 -2.132722 -1.696441
H  -3.110055 -1.215253 -1.736027
H  -2.405552 1.037917 -1.420302
H  -3.89284 1.004493 -2.318405
H  -5.197028 1.764408 -0.428943
H  -3.881005 1.551432 0.686136
H  -4.338656 3.945919 -0.049769
H  -3.83213 3.500848 -1.661153
H  -1.564049 2.880947 -0.715285
H  -3.069123 -2.117207 0.495236
H  -3.640838 -0.618174 1.192974
H  -5.565465 -0.853563 -1.980199
H  -5.211106 -2.158479 -0.853977
H  -5.706019 -0.586019 -0.244617
H  -2.495797 5.755243 -0.290583
H  -1.973092 5.059415 -1.821827
H  -0.824591 5.241654 -0.499071
H  -2.214706 2.528737 1.683932
H  -0.955392 3.742288 1.528649
H  -2.622469 4.234358 1.812267
H  -1.496407 0.516687 0.675453
H  -0.681156 -2.407606 0.383012
H  0.556191 0.97081 1.664659
H  0.632398 1.128109 -0.080021
H  2.112023 0.858126 0.840809
H  1.502754 -2.849558 0.489916
H  5.609824 -3.767173 0.930564
H  5.670442 -2.073642 1.430391
H  6.778292 -1.881756 -2.63746
totalener: -853.22722691 hartree
nucrepener: 1486.06996256 hartree
electener: -2339.29718947 hartree
oneelecener: -4106.10562438 hartree
twoeener: 1766.80843491 hartree
kineticenergy: 849.18328566 hartree
xcener: -85.613164133916 hartree
chargesum: -0.0000000
charge: -0.262041 -0.382959 0.095439 -0.169720 -0.163456 -0.171416 0.055498 -0.170194 -0.300525 -0.267888 -0.288447 -0.054797 -0.090272 0.039057 -0.254192 -0.169485 0.420414 -0.010588 -0.364062 0.065765 0.054089 0.084182 0.081143 0.087115 0.069301 0.077256 0.070229 0.017734 0.075629 0.091350 0.087973 0.087418 0.078859 0.079407 0.082118 0.084544 0.081856 0.092127 0.089961 0.020424 0.071800 0.088100 0.084976 0.129604 0.095195 0.115570 0.125666 0.240243
qa: -0.2620 -0.3830 0.0954 -0.1697 -0.1635 -0.1714 0.0555 -0.1702 -0.3005 -0.2679 -0.2884 -0.0548 -0.0903 0.0391 -0.2542 -0.1695 0.4204 -0.0106 -0.3641 0.0658 0.0541 0.0842 0.0811 0.0871 0.0693 0.0773 0.0702 0.0177 0.0756 0.0914 0.0880 0.0874 0.0789 0.0794 0.0821 0.0845 0.0819 0.0921 0.0900 0.0204 0.0718 0.0881 0.0850 0.1296 0.0952 0.1156 0.1257 0.2402
va: 2.1319 2.1200 3.8079 3.8644 3.8764 3.9398 3.8104 3.9261 3.9600 3.9431 3.9232 3.8772 3.9873 3.6763 3.9128 3.8107 4.2129 3.9819 3.7887 3.6903 1.0164 1.0105 1.0138 1.0088 1.0053 1.0130 1.0092 1.0232 1.0207 1.0018 1.0057 1.0069 0.9999 1.0060 1.0074 1.0067 0.9996 1.0061 1.0097 1.0243 1.0304 0.9986 1.0013 1.0398 1.0362 0.9855 1.0011 0.9743
dispcorr: -0.021313620 hartree
energy: -853.248540527394
dipole: -39.06956 38.16474 -0.90482 23.51297 -23.71175 -0.19878 -2.91061 2.82028 -0.09033
magnitude: 0.93079 au
magnitude: 2.36589 debye
