program: Orca
programVersion: 5.0.2
elementType: O O C C C C C C C C C C C C C C C C C C H H H H H H H H H H H H H H H H H H H H H H H H H H H H
charge: 0
multiplicity: 1
keywords: wb97x-d3
keywords: def2-TZVPP
keywords: def2/J RIJCOSX
keywords: DEFGRID2
keywords: scfconv7
keywords: smallprint printgap noloewdin
keywords: NOSOSCF
formula: C18H28O2
InChI: InChI=1/C18H28O2/c1-6-13-20-18(19)14-17(5)12-8-11-16(4)10-7-9-15(2)3/h1,8,12,14-16H,7,9-11,13H2,2-5H3
48 atoms
O  4.006752 -2.581507 -0.623853
O  3.485293 -2.484056 1.547164
C  -3.234645 0.12511 -0.750558
C  -3.400667 0.866942 0.577673
C  -3.599294 2.376799 0.464245
C  -2.445542 3.089846 -0.232503
C  -2.498672 4.616516 -0.159627
C  -2.998629 -1.380045 -0.527927
C  -4.429996 0.330092 -1.673599
C  -1.230792 5.218649 -0.75637
C  -3.734489 5.181944 -0.852088
C  -1.79066 -1.663929 0.304725
C  -0.585109 -1.92664 -0.206372
C  0.641579 -2.121342 0.561599
C  0.538295 -2.086637 2.05411
C  1.779055 -2.296142 -0.140065
C  3.135267 -2.456801 0.396994
C  5.37809 -2.68959 -0.278006
C  5.961326 -1.405091 0.086914
C  6.463424 -0.352352 0.364119
H  -2.340238 0.509845 -1.252806
H  -4.2500 0.433258 1.118438
H  -2.518921 0.686094 1.200518
H  -4.542805 2.592383 -0.043734
H  -3.710175 2.783742 1.47455
H  -2.401595 2.793691 -1.287065
H  -1.503426 2.748679 0.211484
H  -2.542223 4.900766 0.898922
H  -2.894466 -1.864064 -1.502831
H  -3.886554 -1.814315 -0.056481
H  -4.315474 -0.235489 -2.599689
H  -5.356584 0.000025 -1.197901
H  -4.557074 1.376976 -1.950138
H  -1.228652 6.306798 -0.677465
H  -1.138461 4.966471 -1.815431
H  -0.336583 4.849119 -0.251843
H  -4.660859 4.840663 -0.389624
H  -3.739922 6.272469 -0.81944
H  -3.760144 4.885836 -1.903966
H  -1.913773 -1.60527 1.38098
H  -0.484125 -1.981334 -1.287129
H  1.487134 -2.260574 2.545417
H  -0.173522 -2.83977 2.396469
H  0.156222 -1.117098 2.379938
H  1.715024 -2.299354 -1.221712
H  5.872149 -3.078154 -1.169065
H  5.527778 -3.407142 0.532267
H  6.901088 0.581114 0.623774
totalener: -853.22864878 hartree
nucrepener: 1451.56857869 hartree
electener: -2304.79722747 hartree
oneelecener: -4037.20273799 hartree
twoeener: 1732.40551051 hartree
kineticenergy: 849.18964933 hartree
xcener: -85.611493918460 hartree
chargesum: -0.0000000
charge: -0.262227 -0.382239 0.083031 -0.193216 -0.138151 -0.149517 0.047534 -0.160747 -0.290720 -0.261793 -0.273692 -0.109092 -0.089608 0.030913 -0.263959 -0.162987 0.419404 -0.010373 -0.364810 0.066372 0.049083 0.079877 0.073308 0.068839 0.077168 0.058543 0.074143 0.026316 0.078323 0.087345 0.084955 0.084196 0.082448 0.082347 0.074925 0.081875 0.083709 0.084346 0.075473 0.103966 0.074252 0.124228 0.091822 0.087869 0.094898 0.115534 0.125924 0.240169
qa: -0.2622 -0.3822 0.0830 -0.1932 -0.1382 -0.1495 0.0475 -0.1607 -0.2907 -0.2618 -0.2737 -0.1091 -0.0896 0.0309 -0.2640 -0.1630 0.4194 -0.0104 -0.3648 0.0664 0.0491 0.0799 0.0733 0.0688 0.0772 0.0585 0.0741 0.0263 0.0783 0.0873 0.0850 0.0842 0.0824 0.0823 0.0749 0.0819 0.0837 0.0843 0.0755 0.1040 0.0743 0.1242 0.0918 0.0879 0.0949 0.1155 0.1259 0.2402
va: 2.1310 2.1205 3.7627 3.9335 3.8848 3.8656 3.8622 3.9464 3.9605 3.9393 3.9312 3.8800 3.9292 3.6811 3.9251 3.7979 4.2161 3.9821 3.7859 3.6896 1.0195 1.0102 1.0122 1.0052 1.0125 1.0141 1.0134 1.0175 1.0177 1.0114 1.0089 1.0032 1.0040 1.0078 1.0057 1.0077 1.0055 1.0084 1.0061 1.0006 1.0309 1.0388 0.9976 0.9988 1.0363 0.9854 1.0008 0.9743
dispcorr: -0.019140524 hartree
energy: -853.247789303575
dipole: -38.57117 37.80386 -0.76731 28.16645 -27.96821 0.19825 -4.44359 4.03312 -0.41047
magnitude: 0.89250 au
magnitude: 2.26856 debye
