program: Orca
programVersion: 5.0.2
elementType: O O C C C C C C C C C C C C C C C C C C H H H H H H H H H H H H H H H H H H H H H H H H H H H H
charge: 0
multiplicity: 1
keywords: wb97x-d3
keywords: def2-TZVPP
keywords: def2/J RIJCOSX
keywords: DEFGRID2
keywords: scfconv7
keywords: smallprint printgap noloewdin
keywords: NOSOSCF
formula: C18H28O2
InChI: InChI=1/C18H28O2/c1-6-13-20-18(19)14-17(5)12-8-11-16(4)10-7-9-15(2)3/h1,8,12,14-16H,7,9-11,13H2,2-5H3
48 atoms
O  3.420289 -1.078374 1.150596
O  3.076689 -1.987546 -0.864049
C  -4.365892 -0.1282 -0.381462
C  -3.469769 1.060554 -0.74192
C  -2.985202 1.915617 0.426767
C  -1.914213 2.921284 0.001775
C  -0.514279 2.324009 -0.18371
C  -3.640285 -1.182572 0.47278
C  -5.661057 0.301155 0.298889
C  0.363302 3.250314 -1.018074
C  0.15388 2.035263 1.156604
C  -2.348216 -1.615221 -0.132297
C  -1.157676 -1.451956 0.449442
C  0.138037 -1.759904 -0.147614
C  0.151225 -2.362994 -1.516967
C  1.228538 -1.43746 0.575727
C  2.631858 -1.554313 0.165823
C  4.812958 -1.027817 0.886856
C  5.172079 0.124287 0.070042
C  5.480967 1.083095 -0.580301
H  -4.634699 -0.61352 -1.327717
H  -2.605406 0.688453 -1.29971
H  -4.013836 1.704456 -1.440903
H  -3.832875 2.45343 0.859224
H  -2.595316 1.284052 1.230726
H  -1.850936 3.730905 0.736457
H  -2.235294 3.394744 -0.932742
H  -0.607516 1.374393 -0.723989
H  -4.302748 -2.048151 0.583248
H  -3.468829 -0.799473 1.482576
H  -6.324655 -0.5503 0.458473
H  -5.473954 0.754506 1.273808
H  -6.201892 1.030863 -0.30549
H  -0.063682 3.420699 -2.007747
H  1.362672 2.834529 -1.155065
H  0.475001 4.22426 -0.535393
H  -0.45183 1.383167 1.788051
H  1.120725 1.549096 1.019609
H  0.324289 2.961059 1.711766
H  -2.40898 -2.046777 -1.127772
H  -1.129126 -1.011746 1.442224
H  1.15054 -2.592196 -1.864748
H  -0.310316 -1.678999 -2.232049
H  -0.439502 -3.280612 -1.527767
H  1.077246 -1.003842 1.556868
H  5.161449 -1.946088 0.408435
H  5.292581 -0.951333 1.863314
H  5.752477 1.926971 -1.167447
totalener: -853.22759082 hartree
nucrepener: 1561.31583028 hartree
electener: -2414.54342111 hartree
oneelecener: -4256.78899696 hartree
twoeener: 1842.24557586 hartree
kineticenergy: 849.19173842 hartree
xcener: -85.614736626525 hartree
chargesum: -0.0000000
charge: -0.261404 -0.381807 0.048952 -0.154608 -0.142741 -0.173447 0.074628 -0.149629 -0.300672 -0.265894 -0.300237 -0.085380 -0.144344 0.054997 -0.264611 -0.187509 0.428836 -0.012061 -0.365645 0.066645 0.052307 0.080346 0.083007 0.084520 0.059578 0.076728 0.066737 0.015447 0.092302 0.072418 0.087547 0.080645 0.089605 0.078109 0.087779 0.078843 0.069373 0.092830 0.090688 0.104760 0.075765 0.123021 0.091159 0.093502 0.103984 0.127091 0.116330 0.241512
qa: -0.2614 -0.3818 0.0490 -0.1546 -0.1427 -0.1734 0.0746 -0.1496 -0.3007 -0.2659 -0.3002 -0.0854 -0.1443 0.0550 -0.2646 -0.1875 0.4288 -0.0121 -0.3656 0.0666 0.0523 0.0803 0.0830 0.0845 0.0596 0.0767 0.0667 0.0154 0.0923 0.0724 0.0875 0.0806 0.0896 0.0781 0.0878 0.0788 0.0694 0.0928 0.0907 0.1048 0.0758 0.1230 0.0912 0.0935 0.1040 0.1271 0.1163 0.2415
va: 2.1242 2.1222 3.8214 3.8368 3.8826 3.9569 3.7818 3.9449 3.9615 3.9352 3.9441 3.8336 3.9428 3.5979 3.9239 3.7691 4.2155 3.9818 3.7939 3.6891 1.0124 1.0145 1.0114 1.0094 1.0100 1.0122 1.0078 1.0285 1.0104 1.0094 1.0069 0.9988 1.0050 1.0071 1.0077 1.0049 1.0057 1.0038 1.0151 1.0065 1.0287 1.0385 0.9978 0.9972 1.0298 1.0023 0.9850 0.9740
dispcorr: -0.023570294 hartree
energy: -853.251161115960
dipole: -29.33201 28.52934 -0.80267 15.40875 -15.25453 0.15421 -1.24525 1.51726 0.27202
magnitude: 0.86143 au
magnitude: 2.18958 debye
