program: Orca
programVersion: 5.0.2
elementType: O O C C C C C C C C C C C C C C C C C C H H H H H H H H H H H H H H H H H H H H H H H H H H H H
charge: 0
multiplicity: 1
keywords: wb97x-d3
keywords: def2-TZVPP
keywords: def2/J RIJCOSX
keywords: DEFGRID2
keywords: scfconv7
keywords: smallprint printgap noloewdin
keywords: NOSOSCF
formula: C18H28O2
InChI: InChI=1/C18H28O2/c1-6-13-20-18(19)14-17(5)12-8-11-16(4)10-7-9-15(2)3/h1,8,12,14-16H,7,9-11,13H2,2-5H3
48 atoms
O  4.989764 -1.716607 0.231448
O  3.773158 -3.586223 0.386337
C  -2.782115 0.552582 0.410548
C  -3.860161 1.586263 0.065599
C  -3.370379 3.021692 -0.09625
C  -4.49677 4.031411 -0.308379
C  -5.385953 3.801112 -1.533082
C  -1.740442 0.424648 -0.712418
C  -2.118676 0.825152 1.756425
C  -6.463223 4.877945 -1.605839
C  -4.582711 3.761641 -2.82885
C  -0.826286 -0.737624 -0.518937
C  0.498676 -0.645212 -0.381759
C  1.414433 -1.762345 -0.164699
C  0.828809 -3.137961 -0.094197
C  2.7224 -1.462611 -0.036848
C  3.825837 -2.396966 0.215368
C  6.160087 -2.460966 0.527293
C  6.300205 -2.729558 1.952451
C  6.445944 -2.936944 3.124128
H  -3.295443 -0.414011 0.486568
H  -4.361713 1.264466 -0.852825
H  -4.626908 1.560775 0.847747
H  -2.81433 3.32285 0.795668
H  -2.658325 3.086306 -0.923823
H  -4.059501 5.033628 -0.3802
H  -5.130005 4.045836 0.585548
H  -5.892578 2.836222 -1.418118
H  -1.155958 1.345319 -0.79228
H  -2.269327 0.305915 -1.665724
H  -1.511838 1.731875 1.733663
H  -2.864116 0.946031 2.543986
H  -1.459168 0.007773 2.048493
H  -7.141883 4.707669 -2.442876
H  -6.019415 5.867514 -1.737753
H  -7.06381 4.906147 -0.695068
H  -4.019919 4.687945 -2.96809
H  -3.868893 2.936919 -2.84888
H  -5.237151 3.642966 -3.693575
H  -1.305855 -1.711796 -0.475789
H  0.952838 0.340754 -0.424285
H  0.106818 -3.195836 0.722579
H  1.576587 -3.905588 0.059061
H  0.286267 -3.360886 -1.014741
H  3.016836 -0.422635 -0.113654
H  6.991294 -1.842876 0.186567
H  6.185537 -3.399909 -0.030554
H  6.559862 -3.131164 4.163014
totalener: -853.22873629 hartree
nucrepener: 1420.94717368 hartree
electener: -2274.17590997 hartree
oneelecener: -3975.91984894 hartree
twoeener: 1701.74393897 hartree
kineticenergy: 849.18552334 hartree
xcener: -85.611981719661 hartree
chargesum: 0.0000000
charge: -0.262165 -0.382368 0.083637 -0.177727 -0.133351 -0.192356 0.051443 -0.118188 -0.309079 -0.267575 -0.273098 -0.158615 -0.072739 0.034674 -0.265221 -0.163627 0.420840 -0.011716 -0.365602 0.068584 0.049536 0.073932 0.081084 0.086939 0.070608 0.074687 0.071091 0.032818 0.066636 0.090172 0.074966 0.092893 0.097162 0.082132 0.076158 0.081306 0.081497 0.074301 0.085896 0.097018 0.072226 0.089898 0.123679 0.090347 0.095328 0.116174 0.125920 0.239845
qa: -0.2622 -0.3824 0.0836 -0.1777 -0.1334 -0.1924 0.0514 -0.1182 -0.3091 -0.2676 -0.2731 -0.1586 -0.0727 0.0347 -0.2652 -0.1636 0.4208 -0.0117 -0.3656 0.0686 0.0495 0.0739 0.0811 0.0869 0.0706 0.0747 0.0711 0.0328 0.0666 0.0902 0.0750 0.0929 0.0972 0.0821 0.0762 0.0813 0.0815 0.0743 0.0859 0.0970 0.0722 0.0899 0.1237 0.0903 0.0953 0.1162 0.1259 0.2398
va: 2.1312 2.1204 3.7735 3.8880 3.8576 3.9256 3.8204 3.9524 3.9583 3.9436 3.9383 3.9323 3.9521 3.6852 3.9254 3.7961 4.2164 3.9824 3.7921 3.6859 1.0155 1.0108 1.0119 1.0106 1.0045 1.0121 1.0109 1.0142 1.0164 1.0082 1.0025 1.0047 1.0059 1.0075 1.0065 1.0070 1.0052 1.0045 1.0089 1.0114 1.0311 0.9982 1.0389 0.9973 1.0362 0.9851 1.0013 0.9745
dispcorr: -0.019222909 hartree
energy: -853.247959202172
dipole: -47.74152 47.07683 -0.66469 28.99513 -28.34357 0.65156 -7.66441 7.49101 -0.17340
magnitude: 0.94679 au
magnitude: 2.40654 debye
