program: Orca
programVersion: 5.0.2
elementType: O O C C C C C C C C C C C C C C C C C C H H H H H H H H H H H H H H H H H H H H H H H H H H H H
charge: 0
multiplicity: 1
keywords: wb97x-d3
keywords: def2-TZVPP
keywords: def2/J RIJCOSX
keywords: DEFGRID2
keywords: scfconv7
keywords: smallprint printgap noloewdin
keywords: NOSOSCF
formula: C18H28O2
InChI: InChI=1/C18H28O2/c1-6-13-20-18(19)14-17(5)12-8-11-16(4)10-7-9-15(2)3/h1,8,12,14-16H,7,9-11,13H2,2-5H3
48 atoms
O  4.549514 -2.6232 1.556935
O  3.841083 -3.778684 -0.221199
C  -2.303877 0.777701 -0.366332
C  -3.383315 1.706996 0.193875
C  -3.48454 3.060794 -0.500068
C  -4.522456 3.9718 0.145891
C  -4.608781 5.376669 -0.453449
C  -2.15444 -0.450759 0.548766
C  -2.591343 0.370752 -1.807578
C  -5.051953 5.358219 -1.913061
C  -5.548101 6.248886 0.372881
C  -1.083658 -1.393872 0.109399
C  0.1196 -1.477301 0.683036
C  1.212791 -2.340981 0.244284
C  0.9617 -3.238686 -0.9265
C  2.373456 -2.25124 0.923454
C  3.617846 -2.980272 0.650374
C  5.841529 -3.186377 1.397815
C  6.600777 -2.539058 0.335839
C  7.246407 -1.996574 -0.516323
H  -1.347214 1.31322 -0.345879
H  -4.354184 1.199423 0.145811
H  -3.186128 1.873664 1.258638
H  -2.505615 3.552818 -0.4770
H  -3.72857 2.918905 -1.55548
H  -4.297074 4.059614 1.214425
H  -5.509983 3.498251 0.087368
H  -3.607585 5.822547 -0.408219
H  -3.113967 -0.979026 0.58544
H  -1.947725 -0.109194 1.56671
H  -3.52427 -0.194893 -1.875631
H  -2.685206 1.237407 -2.460984
H  -1.795365 -0.248607 -2.221597
H  -4.354037 4.817383 -2.552491
H  -5.134964 6.370778 -2.310837
H  -6.0315 4.884856 -2.016454
H  -5.590038 7.268387 -0.013377
H  -6.565372 5.850671 0.358656
H  -5.231117 6.303605 1.415585
H  -1.309928 -2.020009 -0.747359
H  0.327474 -0.843734 1.541037
H  0.104162 -3.883413 -0.726037
H  1.812853 -3.862606 -1.167597
H  0.713542 -2.64383 -1.807666
H  2.424639 -1.560663 1.756899
H  5.785907 -4.26127 1.210502
H  6.343602 -3.035599 2.353969
H  7.807944 -1.519867 -1.282968
totalener: -853.23001524 hartree
nucrepener: 1396.75741532 hartree
electener: -2249.98743055 hartree
oneelecener: -3927.53424816 hartree
twoeener: 1677.54681761 hartree
kineticenergy: 849.18356307 hartree
xcener: -85.608844325688 hartree
chargesum: -0.0000000
charge: -0.262230 -0.382443 0.129650 -0.185277 -0.103121 -0.152452 0.054358 -0.151096 -0.315750 -0.276791 -0.265346 -0.126724 -0.082635 0.033931 -0.265566 -0.164464 0.420284 -0.010981 -0.364005 0.065888 0.041584 0.064890 0.067230 0.061435 0.060348 0.063755 0.061473 0.024896 0.087947 0.072005 0.083034 0.089050 0.087774 0.082443 0.084397 0.077751 0.082615 0.075581 0.080150 0.101794 0.073137 0.090171 0.124259 0.089985 0.095004 0.126069 0.116074 0.239917
qa: -0.2622 -0.3824 0.1297 -0.1853 -0.1031 -0.1525 0.0544 -0.1511 -0.3157 -0.2768 -0.2653 -0.1267 -0.0826 0.0339 -0.2656 -0.1645 0.4203 -0.0110 -0.3640 0.0659 0.0416 0.0649 0.0672 0.0614 0.0603 0.0638 0.0615 0.0249 0.0879 0.0720 0.0830 0.0890 0.0878 0.0824 0.0844 0.0778 0.0826 0.0756 0.0802 0.1018 0.0731 0.0902 0.1243 0.0900 0.0950 0.1261 0.1161 0.2399
va: 2.1311 2.1209 3.7466 3.9440 3.8597 3.9019 3.8502 3.9678 3.9653 3.9328 3.9408 3.8982 3.9462 3.6835 3.9270 3.7976 4.2154 3.9814 3.7884 3.6916 1.0246 1.0114 1.0140 1.0112 1.0139 1.0146 1.0137 1.0167 1.0080 1.0202 1.0017 1.0078 1.0054 1.0053 1.0076 1.0050 1.0078 1.0056 1.0076 1.0028 1.0312 0.9974 1.0390 0.9989 1.0362 1.0007 0.9853 0.9745
dispcorr: -0.018051602 hartree
energy: -853.248066839166
dipole: -47.45932 46.76691 -0.69241 34.07808 -33.48161 0.59647 -8.14835 8.40134 0.25298
magnitude: 0.94827 au
magnitude: 2.41031 debye
