program: Orca
programVersion: 5.0.2
elementType: O O C C C C C C C C C C C C C C C C C C H H H H H H H H H H H H H H H H H H H H H H H H H H H H
charge: 0
multiplicity: 1
keywords: wb97x-d3
keywords: def2-TZVPP
keywords: def2/J RIJCOSX
keywords: DEFGRID2
keywords: scfconv7
keywords: smallprint printgap noloewdin
keywords: NOSOSCF
formula: C18H28O2
InChI: InChI=1/C18H28O2/c1-6-13-20-18(19)14-17(5)12-8-11-16(4)10-7-9-15(2)3/h1,8,12,14-16H,7,9-11,13H2,2-5H3
48 atoms
O  3.877456 -0.459744 0.34757
O  3.311051 -2.317337 -0.761242
C  -4.219674 -0.437822 0.055754
C  -3.617366 0.519233 -0.978054
C  -3.006805 1.798663 -0.416132
C  -2.342761 2.636753 -1.504206
C  -1.609989 3.893086 -1.021532
C  -3.189587 -0.9119 1.093852
C  -5.436348 0.152296 0.760809
C  -2.552432 4.906221 -0.379173
C  -0.447116 3.561275 -0.08994
C  -1.971265 -1.51583 0.482919
C  -0.732245 -1.044529 0.646329
C  0.481564 -1.608784 0.062515
C  0.339911 -2.825858 -0.796568
C  1.641535 -0.983578 0.34633
C  2.986153 -1.366366 -0.100404
C  5.242784 -0.705172 0.05278
C  5.830301 -1.693513 0.947474
C  6.334636 -2.487419 1.690985
H  -4.557017 -1.32395 -0.495579
H  -2.845714 -0.012537 -1.543915
H  -4.392983 0.778748 -1.706361
H  -3.774652 2.387658 0.093472
H  -2.263692 1.541767 0.342885
H  -3.09837 2.928917 -2.241662
H  -1.628233 2.00494 -2.042861
H  -1.185797 4.363555 -1.915682
H  -3.672991 -1.656929 1.735716
H  -2.908606 -0.084578 1.751281
H  -6.191059 0.475271 0.042368
H  -5.903862 -0.579848 1.421213
H  -5.171512 1.016726 1.372112
H  -2.030339 5.835618 -0.146659
H  -2.973265 4.531089 0.555588
H  -3.384856 5.153764 -1.040325
H  0.220428 2.818305 -0.530471
H  0.146671 4.450567 0.126549
H  -0.794377 3.167959 0.867349
H  -2.136775 -2.390593 -0.140045
H  -0.5943 -0.165982 1.270864
H  -0.3387 -2.621379 -1.626808
H  -0.100692 -3.641056 -0.219585
H  1.284281 -3.167163 -1.200958
H  1.605103 -0.10393 0.978248
H  5.745278 0.253876 0.182742
H  5.375271 -1.018964 -0.985226
H  6.770772 -3.20051 2.347682
totalener: -853.22846164 hartree
nucrepener: 1494.33230002 hartree
electener: -2347.56076167 hartree
oneelecener: -4122.75501781 hartree
twoeener: 1775.19425614 hartree
kineticenergy: 849.18754820 hartree
xcener: -85.613393453724 hartree
chargesum: 0.0000000
charge: -0.261532 -0.382750 0.064196 -0.143282 -0.164292 -0.150393 0.066466 -0.157186 -0.302683 -0.289637 -0.293625 -0.107809 -0.100963 0.045396 -0.265914 -0.171108 0.420038 -0.011892 -0.365913 0.069421 0.054629 0.075360 0.082028 0.083982 0.047631 0.072223 0.074012 0.038852 0.094455 0.073746 0.089205 0.087901 0.077232 0.087376 0.072601 0.086076 0.091052 0.090028 0.069354 0.102564 0.071048 0.087952 0.093648 0.123090 0.095507 0.115805 0.125712 0.240397
qa: -0.2615 -0.3827 0.0642 -0.1433 -0.1643 -0.1504 0.0665 -0.1572 -0.3027 -0.2896 -0.2936 -0.1078 -0.1010 0.0454 -0.2659 -0.1711 0.4200 -0.0119 -0.3659 0.0694 0.0546 0.0754 0.0820 0.0840 0.0476 0.0722 0.0740 0.0389 0.0945 0.0737 0.0892 0.0879 0.0772 0.0874 0.0726 0.0861 0.0911 0.0900 0.0694 0.1026 0.0710 0.0880 0.0936 0.1231 0.0955 0.1158 0.1257 0.2404
va: 2.1318 2.1200 3.8052 3.8811 3.8720 3.8950 3.8440 3.9377 3.9610 3.9485 3.9509 3.8599 3.9387 3.6643 3.9239 3.7942 4.2180 3.9832 3.7940 3.6833 1.0116 1.0130 1.0100 1.0019 1.0066 1.0115 1.0124 1.0098 1.0089 1.0060 1.0055 1.0066 1.0005 1.0074 1.0010 1.0049 1.0049 1.0090 0.9997 1.0074 1.0296 0.9978 0.9978 1.0391 1.0367 0.9851 1.0017 0.9742
dispcorr: -0.020549424 hartree
energy: -853.249011067813
dipole: -36.35249 35.55349 -0.79900 20.34220 -19.91958 0.42262 -2.66667 2.80812 0.14145
magnitude: 0.91488 au
magnitude: 2.32545 debye
