program: Orca
programVersion: 5.0.2
elementType: O O C C C C C C C C C C C C C C C C C C H H H H H H H H H H H H H H H H H H H H H H H H H H H H
charge: 0
multiplicity: 1
keywords: wb97x-d3
keywords: def2-TZVPP
keywords: def2/J RIJCOSX
keywords: DEFGRID2
keywords: scfconv7
keywords: smallprint printgap noloewdin
keywords: NOSOSCF
formula: C18H28O2
InChI: InChI=1/C18H28O2/c1-6-13-20-18(19)14-17(5)12-8-11-16(4)10-7-9-15(2)3/h1,8,12,14-16H,7,9-11,13H2,2-5H3
48 atoms
O  3.840352 -0.413496 0.340468
O  3.290261 -2.271511 -0.775569
C  -4.242026 -0.43953 0.051957
C  -3.626285 0.513322 -0.977807
C  -3.003815 1.78492 -0.411349
C  -2.299649 2.60231 -1.49017
C  -1.523758 3.827294 -0.994482
C  -3.219875 -0.926932 1.092354
C  -5.454052 0.16207 0.755167
C  -2.4288 4.861325 -0.332304
C  -0.367797 3.443633 -0.073805
C  -1.997751 -1.52511 0.483143
C  -0.7615 -1.048322 0.651818
C  0.456457 -1.599513 0.06428
C  0.32485 -2.81629 -0.796824
C  1.610462 -0.962234 0.345691
C  2.957478 -1.328095 -0.107902
C  5.206884 -0.641884 0.037675
C  5.808782 -1.632553 0.920131
C  6.324345 -2.428296 1.653814
H  -4.586867 -1.320731 -0.502563
H  -2.858207 -0.025963 -1.54134
H  -4.395889 0.782311 -1.709001
H  -3.770932 2.392199 0.077318
H  -2.282391 1.519968 0.365463
H  -3.037133 2.925343 -2.233035
H  -1.603901 1.946821 -2.025118
H  -1.088109 4.295944 -1.884051
H  -3.709227 -1.677523 1.723037
H  -2.941929 -0.107022 1.760276
H  -6.203648 0.494131 0.035513
H  -5.930835 -0.565981 1.413504
H  -5.181119 1.022746 1.368227
H  -3.257361 5.14469 -0.983963
H  -1.875507 5.770134 -0.090679
H  -2.855188 4.486649 0.600137
H  0.274527 2.688334 -0.530635
H  0.253896 4.310254 0.155799
H  -0.723183 3.044093 0.877997
H  -2.157885 -2.397099 -0.145113
H  -0.629691 -0.172587 1.281573
H  1.272113 -3.149884 -1.200926
H  -0.354336 -2.615597 -1.627549
H  -0.110543 -3.635461 -0.221515
H  1.566508 -0.084724 0.98011
H  5.699852 0.321087 0.174605
H  5.338146 -0.944291 -1.003842
H  6.769255 -3.143894 2.301678
totalener: -853.22830445 hartree
nucrepener: 1498.89583016 hartree
electener: -2352.12413460 hartree
oneelecener: -4131.88548465 hartree
twoeener: 1779.76135005 hartree
kineticenergy: 849.18807736 hartree
xcener: -85.613571081057 hartree
chargesum: 0.0000000
charge: -0.261564 -0.382755 0.063297 -0.141884 -0.166887 -0.149231 0.065949 -0.156830 -0.302997 -0.289333 -0.294106 -0.106272 -0.103886 0.048812 -0.266421 -0.173434 0.420693 -0.011920 -0.365959 0.069293 0.054830 0.074618 0.082591 0.085101 0.046916 0.073119 0.073673 0.038649 0.094383 0.073657 0.089015 0.087954 0.077555 0.086162 0.087462 0.072892 0.091277 0.090349 0.068865 0.103069 0.070770 0.123160 0.087900 0.093807 0.095689 0.115871 0.125693 0.240406
qa: -0.2616 -0.3828 0.0633 -0.1419 -0.1669 -0.1492 0.0659 -0.1568 -0.3030 -0.2893 -0.2941 -0.1063 -0.1039 0.0488 -0.2664 -0.1734 0.4207 -0.0119 -0.3660 0.0693 0.0548 0.0746 0.0826 0.0851 0.0469 0.0731 0.0737 0.0386 0.0944 0.0737 0.0890 0.0880 0.0776 0.0862 0.0875 0.0729 0.0913 0.0903 0.0689 0.1031 0.0708 0.1232 0.0879 0.0938 0.0957 0.1159 0.1257 0.2404
va: 2.1316 2.1200 3.8076 3.8803 3.8728 3.8919 3.8438 3.9379 3.9613 3.9485 3.9519 3.8567 3.9400 3.6559 3.9241 3.7936 4.2183 3.9833 3.7931 3.6835 1.0116 1.0133 1.0098 1.0021 1.0071 1.0113 1.0128 1.0099 1.0091 1.0060 1.0055 1.0066 1.0003 1.0048 1.0075 1.0007 1.0046 1.0094 0.9998 1.0071 1.0294 1.0391 0.9978 0.9978 1.0366 0.9851 1.0015 0.9742
dispcorr: -0.020757746 hartree
energy: -853.249062191310
dipole: -35.94844 35.14624 -0.80220 19.88144 -19.46564 0.41580 -2.51642 2.65805 0.14163
magnitude: 0.91459 au
magnitude: 2.32471 debye
