program: Orca
programVersion: 5.0.2
elementType: O O C C C C C C C C C C C C C C C C C C H H H H H H H H H H H H H H H H H H H H H H H H H H H H
charge: 0
multiplicity: 1
keywords: wb97x-d3
keywords: def2-TZVPP
keywords: def2/J RIJCOSX
keywords: DEFGRID2
keywords: scfconv7
keywords: smallprint printgap noloewdin
keywords: NOSOSCF
formula: C18H28O2
InChI: InChI=1/C18H28O2/c1-6-13-20-18(19)14-17(5)12-8-11-16(4)10-7-9-15(2)3/h1,8,12,14-16H,7,9-11,13H2,2-5H3
48 atoms
O  3.666943 -1.250457 -0.643571
O  3.00052 -2.387462 1.163508
C  -4.299677 -0.064747 -0.066722
C  -3.488829 1.07394 0.552485
C  -2.710654 1.931508 -0.43708
C  -1.944891 3.052895 0.257896
C  -0.953379 3.822241 -0.621384
C  -3.435072 -1.010671 -0.922267
C  -5.061026 -0.825621 1.014673
C  0.185082 2.93528 -1.119118
C  -1.637849 4.533675 -1.783457
C  -2.252005 -1.559604 -0.196396
C  -0.985317 -1.335202 -0.556508
C  0.203668 -1.80952 0.145943
C  0.001652 -2.651848 1.36606
C  1.396702 -1.435179 -0.357621
C  2.725151 -1.763159 0.173003
C  5.019537 -1.442893 -0.263787
C  5.450107 -0.492041 0.752382
C  5.836067 0.298723 1.56667
H  -5.039668 0.37495 -0.74574
H  -4.16993 1.713601 1.123982
H  -2.788147 0.65709 1.284998
H  -2.00739 1.302081 -0.986278
H  -3.398152 2.344916 -1.182107
H  -1.393723 2.627617 1.103645
H  -2.660017 3.759166 0.693104
H  -0.508382 4.592498 0.018519
H  -3.101886 -0.495431 -1.825877
H  -4.067437 -1.83861 -1.261622
H  -4.386771 -1.271705 1.748586
H  -5.73203 -0.160993 1.560363
H  -5.667029 -1.627941 0.590754
H  0.953698 3.528039 -1.617197
H  -0.16309 2.193711 -1.840955
H  0.66375 2.396947 -0.299278
H  -2.066793 3.82511 -2.494581
H  -2.444026 5.182875 -1.436999
H  -0.930379 5.15487 -2.334955
H  -2.458387 -2.160944 0.683652
H  -0.801359 -0.73324 -1.442432
H  -0.544927 -2.08573 2.12288
H  0.933059 -2.98937 1.802649
H  -0.605122 -3.525699 1.122481
H  1.402932 -0.821408 -1.25074
H  5.601084 -1.293417 -1.174229
H  5.193086 -2.46348 0.085292
H  6.167073 0.99138 2.301914
totalener: -853.22808412 hartree
nucrepener: 1511.76742066 hartree
electener: -2364.99550477 hartree
oneelecener: -4157.65982851 hartree
twoeener: 1792.66432373 hartree
kineticenergy: 849.19167042 hartree
xcener: -85.614222428976 hartree
chargesum: -0.0000000
charge: -0.260983 -0.382980 0.055502 -0.155275 -0.127894 -0.150202 0.054961 -0.131244 -0.283997 -0.286907 -0.287267 -0.129570 -0.103758 0.058903 -0.267142 -0.179020 0.420926 -0.013903 -0.365295 0.070873 0.042996 0.077619 0.065576 0.036056 0.076949 0.072921 0.073163 0.040053 0.082427 0.094406 0.072849 0.086662 0.087102 0.091234 0.061531 0.094846 0.074295 0.085446 0.087305 0.103589 0.074130 0.091288 0.123803 0.091067 0.095308 0.115467 0.126245 0.239936
qa: -0.2610 -0.3830 0.0555 -0.1553 -0.1279 -0.1502 0.0550 -0.1312 -0.2840 -0.2869 -0.2873 -0.1296 -0.1038 0.0589 -0.2671 -0.1790 0.4209 -0.0139 -0.3653 0.0709 0.0430 0.0776 0.0656 0.0361 0.0769 0.0729 0.0732 0.0401 0.0824 0.0944 0.0728 0.0867 0.0871 0.0912 0.0615 0.0948 0.0743 0.0854 0.0873 0.1036 0.0741 0.0913 0.1238 0.0911 0.0953 0.1155 0.1262 0.2399
va: 2.1319 2.1199 3.8177 3.9014 3.8633 3.8978 3.8540 3.9053 3.9590 3.9515 3.9459 3.8532 3.9429 3.6340 3.9230 3.7983 4.2189 3.9855 3.7964 3.6796 1.0165 1.0120 1.0110 1.0187 1.0108 1.0115 1.0114 1.0100 1.0077 1.0081 1.0042 1.0078 1.0072 1.0092 1.0016 1.0042 1.0003 1.0049 1.0073 1.0007 1.0272 0.9983 1.0387 0.9971 1.0367 0.9851 1.0020 0.9745
dispcorr: -0.020958719 hartree
energy: -853.249042836190
dipole: -31.90435 31.16042 -0.74393 17.91310 -17.61279 0.30031 -3.29227 2.89158 -0.40069
magnitude: 0.89675 au
magnitude: 2.27937 debye
