program: Orca
programVersion: 5.0.2
elementType: O O C C C C C C C C C C C C C C C C C C H H H H H H H H H H H H H H H H H H H H H H H H H H H H
charge: 0
multiplicity: 1
keywords: wb97x-d3
keywords: def2-TZVPP
keywords: def2/J RIJCOSX
keywords: DEFGRID2
keywords: scfconv7
keywords: smallprint printgap noloewdin
keywords: NOSOSCF
formula: C18H28O2
InChI: InChI=1/C18H28O2/c1-6-13-20-18(19)14-17(5)12-8-11-16(4)10-7-9-15(2)3/h1,8,12,14-16H,7,9-11,13H2,2-5H3
48 atoms
O  3.65902 -2.196905 1.420464
O  3.38833 -1.744845 -0.752264
C  -4.006631 0.007716 0.363817
C  -3.222953 1.114847 1.08975
C  -3.036047 2.382651 0.258185
C  -1.979087 2.206173 -0.827373
C  -1.804751 3.388982 -1.779826
C  -3.37891 -1.378729 0.581576
C  -5.473594 0.013491 0.777423
C  -1.374617 4.657989 -1.050897
C  -0.800867 3.036208 -2.873097
C  -2.046663 -1.480727 -0.079448
C  -0.885305 -1.659967 0.554089
C  0.431457 -1.678264 -0.078491
C  0.495134 -1.444668 -1.555308
C  1.492832 -1.888578 0.725056
C  2.907247 -1.922959 0.335348
C  5.064957 -2.204359 1.236045
C  5.622213 -0.858884 1.188068
C  6.10205 0.239648 1.172189
H  -3.971716 0.205833 -0.714641
H  -3.737635 1.35766 2.024268
H  -2.232991 0.752654 1.382641
H  -3.990443 2.678616 -0.192967
H  -2.749232 3.203333 0.919908
H  -2.218041 1.318298 -1.423374
H  -1.015926 1.987079 -0.350451
H  -2.77291 3.582642 -2.257738
H  -4.047516 -2.139851 0.164481
H  -3.295717 -1.586857 1.65265
H  -6.060607 -0.698536 0.195132
H  -5.584608 -0.247432 1.832145
H  -5.918029 1.00014 0.636308
H  -2.115177 4.987776 -0.3222
H  -1.221156 5.481207 -1.750216
H  -0.433757 4.499851 -0.518082
H  -1.11087 2.151702 -3.432533
H  -0.682497 3.852251 -3.587445
H  0.183382 2.826956 -2.447337
H  -2.053343 -1.349747 -1.157926
H  -0.899592 -1.789421 1.632728
H  0.064533 -0.470206 -1.796158
H  -0.099668 -2.194217 -2.080476
H  1.505756 -1.476146 -1.941942
H  1.308952 -2.044948 1.781396
H  5.344663 -2.754317 0.334395
H  5.467889 -2.738929 2.096912
H  6.516528 1.218151 1.147472
totalener: -853.22732244 hartree
nucrepener: 1495.02115362 hartree
electener: -2348.24847605 hartree
oneelecener: -4124.15079233 hartree
twoeener: 1775.90231628 hartree
kineticenergy: 849.19122447 hartree
xcener: -85.610587488736 hartree
chargesum: 0.0000000
charge: -0.261840 -0.382162 0.002419 -0.143405 -0.144037 -0.143418 0.062928 -0.119510 -0.281511 -0.277309 -0.273339 -0.107909 -0.104024 0.039473 -0.248881 -0.166708 0.420838 -0.011972 -0.365851 0.068387 0.051545 0.083506 0.074865 0.064978 0.075836 0.048678 0.065730 0.025947 0.084086 0.076601 0.082767 0.078722 0.089350 0.082700 0.083192 0.080285 0.079524 0.086636 0.080472 0.090015 0.080464 0.078105 0.092020 0.124656 0.094805 0.125968 0.116304 0.240074
qa: -0.2618 -0.3822 0.0024 -0.1434 -0.1440 -0.1434 0.0629 -0.1195 -0.2815 -0.2773 -0.2733 -0.1079 -0.1040 0.0395 -0.2489 -0.1667 0.4208 -0.0120 -0.3659 0.0684 0.0515 0.0835 0.0749 0.0650 0.0758 0.0487 0.0657 0.0259 0.0841 0.0766 0.0828 0.0787 0.0894 0.0827 0.0832 0.0803 0.0795 0.0866 0.0805 0.0900 0.0805 0.0781 0.0920 0.1247 0.0948 0.1260 0.1163 0.2401
va: 2.1311 2.1210 3.7750 3.8567 3.9451 3.8738 3.8471 3.9138 3.9595 3.9428 3.9343 3.8683 3.9148 3.6760 3.9199 3.8001 4.2166 3.9826 3.7916 3.6852 1.0129 1.0063 1.0174 1.0093 1.0115 1.0181 1.0130 1.0165 1.0097 1.0161 1.0072 1.0046 1.0039 1.0050 1.0084 1.0036 1.0061 1.0092 1.0050 1.0110 1.0284 0.9974 0.9979 1.0402 1.0364 1.0013 0.9851 0.9744
dispcorr: -0.020593784 hartree
energy: -853.247916218931
dipole: -34.05823 33.19733 -0.86090 21.25442 -21.21074 0.04368 -7.93358 8.25726 0.32368
magnitude: 0.92077 au
magnitude: 2.34042 debye
