program: Orca
programVersion: 5.0.2
elementType: O O C C C C C C C C C C C C C C C C C C H H H H H H H H H H H H H H H H H H H H H H H H H H H H
charge: 0
multiplicity: 1
keywords: wb97x-d3
keywords: def2-TZVPP
keywords: def2/J RIJCOSX
keywords: DEFGRID2
keywords: scfconv7
keywords: smallprint printgap noloewdin
keywords: NOSOSCF
formula: C18H28O2
InChI: InChI=1/C18H28O2/c1-6-13-20-18(19)14-17(5)12-8-11-16(4)10-7-9-15(2)3/h1,8,12,14-16H,7,9-11,13H2,2-5H3
48 atoms
O  3.678572 -2.200149 1.375369
O  3.397074 -1.644711 -0.772338
C  -4.012177 0.005892 0.377619
C  -3.229888 1.125556 1.085304
C  -3.073725 2.392999 0.246788
C  -2.039175 2.225744 -0.861574
C  -1.882804 3.418891 -1.804549
C  -3.365917 -1.371974 0.593608
C  -5.472446 -0.002647 0.814234
C  -1.409394 4.671711 -1.074351
C  -0.923295 3.068895 -2.937817
C  -2.036451 -1.458896 -0.07524
C  -0.870542 -1.632734 0.551506
C  0.443014 -1.637291 -0.087704
C  0.497278 -1.391559 -1.563015
C  1.509903 -1.8508 0.707589
C  2.922255 -1.872612 0.308909
C  5.083831 -2.209199 1.184434
C  5.653607 -0.869583 1.244297
C  6.14546 0.221443 1.316386
H  -3.996101 0.19797 -0.702342
H  -3.730738 1.36519 2.02811
H  -2.230344 0.777028 1.361422
H  -4.04034 2.678529 -0.184697
H  -2.781372 3.21781 0.901027
H  -2.292129 1.344518 -1.461785
H  -1.066578 2.000743 -0.406867
H  -2.864512 3.631756 -2.245266
H  -4.027897 -2.141928 0.182176
H  -3.273232 -1.577157 1.664409
H  -6.060629 -0.724488 0.245331
H  -5.563818 -0.258816 1.872025
H  -5.930384 0.978111 0.675013
H  -1.273988 5.503763 -1.766885
H  -0.44993 4.494818 -0.582093
H  -2.11614 4.998925 -0.311631
H  -0.816591 3.895197 -3.642127
H  0.071655 2.837012 -2.550366
H  -1.267503 2.199244 -3.500382
H  -2.049667 -1.322259 -1.152951
H  -0.878703 -1.768195 1.629452
H  1.505744 -1.415355 -1.95573
H  0.061492 -0.417118 -1.794256
H  -0.097597 -2.139506 -2.090385
H  1.333093 -2.024035 1.762546
H  5.353758 -2.686408 0.23959
H  5.484719 -2.816288 1.99678
H  6.568475 1.19526 1.372261
totalener: -853.22733927 hartree
nucrepener: 1492.99277962 hartree
electener: -2346.22011889 hartree
oneelecener: -4120.08862341 hartree
twoeener: 1773.86850452 hartree
kineticenergy: 849.19026067 hartree
xcener: -85.610373389272 hartree
chargesum: 0.0000000
charge: -0.261386 -0.383274 0.001463 -0.143029 -0.144599 -0.143967 0.062844 -0.118535 -0.281217 -0.276896 -0.272624 -0.106973 -0.104194 0.039199 -0.248355 -0.166313 0.419943 -0.012837 -0.367708 0.071686 0.051461 0.083475 0.075339 0.064589 0.075952 0.050444 0.064725 0.025701 0.084202 0.076107 0.083006 0.078621 0.089254 0.083131 0.080354 0.082463 0.086504 0.079716 0.080016 0.089035 0.080530 0.124229 0.078554 0.091795 0.095048 0.126025 0.116379 0.240119
qa: -0.2614 -0.3833 0.0015 -0.1430 -0.1446 -0.1440 0.0628 -0.1185 -0.2812 -0.2769 -0.2726 -0.1070 -0.1042 0.0392 -0.2484 -0.1663 0.4199 -0.0128 -0.3677 0.0717 0.0515 0.0835 0.0753 0.0646 0.0760 0.0504 0.0647 0.0257 0.0842 0.0761 0.0830 0.0786 0.0893 0.0831 0.0804 0.0825 0.0865 0.0797 0.0800 0.0890 0.0805 0.1242 0.0786 0.0918 0.0950 0.1260 0.1164 0.2401
va: 2.1320 2.1194 3.7777 3.8556 3.9450 3.8759 3.8487 3.9128 3.9595 3.9427 3.9331 3.8689 3.9139 3.6783 3.9203 3.8007 4.2167 3.9830 3.7983 3.6767 1.0129 1.0063 1.0174 1.0097 1.0119 1.0170 1.0131 1.0165 1.0097 1.0162 1.0071 1.0047 1.0039 1.0082 1.0037 1.0054 1.0091 1.0053 1.0060 1.0115 1.0284 1.0401 0.9978 0.9976 1.0362 1.0024 0.9848 0.9743
dispcorr: -0.020540904 hartree
energy: -853.247880171808
dipole: -34.42352 33.56256 -0.86096 21.10781 -21.09727 0.01054 -8.02913 8.34983 0.32070
magnitude: 0.91881 au
magnitude: 2.33543 debye
