program: Orca
programVersion: 5.0.2
elementType: O O C C C C C C C C C C C C C C C C C C H H H H H H H H H H H H H H H H H H H H H H H H H H H H
charge: 0
multiplicity: 1
keywords: wb97x-d3
keywords: def2-TZVPP
keywords: def2/J RIJCOSX
keywords: DEFGRID2
keywords: scfconv7
keywords: smallprint printgap noloewdin
keywords: NOSOSCF
formula: C18H28O2
InChI: InChI=1/C18H28O2/c1-6-13-20-18(19)14-17(5)12-8-11-16(4)10-7-9-15(2)3/h1,8,12,14-16H,7,9-11,13H2,2-5H3
48 atoms
O  3.468755 -1.656587 1.301584
O  3.102014 -1.808289 -0.898222
C  -4.410738 -0.169748 0.106718
C  -3.703596 1.153293 0.427026
C  -2.598775 1.566837 -0.539809
C  -1.953289 2.893159 -0.156174
C  -0.759004 3.294003 -1.025443
C  -3.621598 -1.405391 0.576453
C  -5.799659 -0.195319 0.739409
C  -0.360555 4.740028 -0.749046
C  0.437501 2.369688 -0.816905
C  -2.306482 -1.596275 -0.096402
C  -1.126491 -1.644313 0.527472
C  0.171352 -1.756861 -0.131704
C  0.182271 -1.900833 -1.62159
C  1.265452 -1.693291 0.653151
C  2.66702 -1.729521 0.220317
C  4.865377 -1.625466 1.056382
C  5.324096 -0.314769 0.615174
C  5.729575 0.762086 0.278491
H  -4.534952 -0.24015 -0.981372
H  -4.452601 1.952246 0.448677
H  -3.299713 1.103896 1.445299
H  -1.836685 0.789646 -0.583152
H  -3.013866 1.645582 -1.55071
H  -1.627958 2.851292 0.890432
H  -2.712046 3.682275 -0.200961
H  -1.067464 3.224573 -2.075963
H  -4.238193 -2.29117 0.383664
H  -3.486014 -1.354971 1.66149
H  -6.325925 -1.126659 0.524345
H  -5.736954 -0.095632 1.825402
H  -6.41578 0.625421 0.370728
H  0.476232 5.051209 -1.376273
H  -0.055421 4.868605 0.292159
H  -1.187525 5.426812 -0.936756
H  0.780786 2.406502 0.219616
H  0.21106 1.327859 -1.045421
H  1.276781 2.661119 -1.449779
H  -2.343791 -1.681462 -1.178918
H  -1.107822 -1.547462 1.609282
H  -0.272292 -1.023025 -2.08656
H  -0.416398 -2.763105 -1.919971
H  1.179848 -2.016634 -2.025573
H  1.121464 -1.587196 1.721821
H  5.156805 -2.384181 0.326219
H  5.332654 -1.876554 2.009056
H  6.075805 1.716981 -0.035531
totalener: -853.22791717 hartree
nucrepener: 1519.73545616 hartree
electener: -2372.96337333 hartree
oneelecener: -4173.67073609 hartree
twoeener: 1800.70736276 hartree
kineticenergy: 849.19001904 hartree
xcener: -85.611304322242 hartree
chargesum: -0.0000000
charge: -0.262141 -0.383107 0.067784 -0.177647 -0.031975 -0.161445 0.054134 -0.131748 -0.273363 -0.264204 -0.240498 -0.115542 -0.087310 0.006408 -0.257701 -0.161937 0.429338 -0.011735 -0.365419 0.068565 0.034789 0.071035 0.061926 -0.006268 0.061317 0.060239 0.064987 0.021792 0.088542 0.070938 0.080584 0.083213 0.082812 0.081945 0.076103 0.078168 0.076659 0.057805 0.086521 0.108010 0.072386 0.084855 0.098432 0.127408 0.093857 0.125466 0.116479 0.239543
qa: -0.2621 -0.3831 0.0678 -0.1776 -0.0320 -0.1614 0.0541 -0.1317 -0.2734 -0.2642 -0.2405 -0.1155 -0.0873 0.0064 -0.2577 -0.1619 0.4293 -0.0117 -0.3654 0.0686 0.0348 0.0710 0.0619 -0.0063 0.0613 0.0602 0.0650 0.0218 0.0885 0.0709 0.0806 0.0832 0.0828 0.0819 0.0761 0.0782 0.0767 0.0578 0.0865 0.1080 0.0724 0.0849 0.0984 0.1274 0.0939 0.1255 0.1165 0.2395
va: 2.1324 2.1180 3.7772 3.9312 3.8072 3.9324 3.8664 3.9383 3.9452 3.9342 3.9378 3.8902 3.9203 3.6762 3.9114 3.7871 4.2094 3.9838 3.7919 3.6869 1.0215 1.0091 1.0123 1.0644 1.0178 1.0133 1.0134 1.0151 1.0078 1.0171 1.0079 1.0023 1.0073 1.0081 1.0056 1.0077 1.0086 1.0124 1.0092 1.0074 1.0314 0.9947 0.9980 1.0393 1.0368 1.0011 0.9852 0.9748
dispcorr: -0.021174350 hartree
energy: -853.249091516727
dipole: -30.44170 29.61429 -0.82740 18.37788 -18.35232 0.02556 -3.81281 4.12614 0.31333
magnitude: 0.88511 au
magnitude: 2.24978 debye
