program: Orca
programVersion: 5.0.2
elementType: O O C C C C C C C C C C C C C C C C C C H H H H H H H H H H H H H H H H H H H H H H H H H H H H
charge: 0
multiplicity: 1
keywords: wb97x-d3
keywords: def2-TZVPP
keywords: def2/J RIJCOSX
keywords: DEFGRID2
keywords: scfconv7
keywords: smallprint printgap noloewdin
keywords: NOSOSCF
formula: C18H28O2
InChI: InChI=1/C18H28O2/c1-6-13-20-18(19)14-17(5)12-8-11-16(4)10-7-9-15(2)3/h1,8,12,14-16H,7,9-11,13H2,2-5H3
48 atoms
O  4.121039 -3.502044 0.656773
O  4.864391 -1.553263 -0.150364
C  -2.460172 1.126593 0.130544
C  -3.817022 1.486506 0.74089
C  -4.955439 1.736005 -0.245306
C  -4.691926 2.873811 -1.224442
C  -5.833029 3.15361 -2.205328
C  -1.442277 0.897354 1.259423
C  -2.544424 -0.090345 -0.781831
C  -7.106692 3.60931 -1.500399
C  -5.399319 4.189542 -3.237965
C  -0.040898 0.738656 0.775164
C  0.686161 -0.372235 0.917672
C  2.061071 -0.560308 0.461153
C  2.73568 0.594746 -0.209291
C  2.615184 -1.769236 0.680752
C  3.975537 -2.200378 0.337235
C  5.404213 -4.071812 0.45542
C  6.319931 -3.754632 1.543365
C  7.074779 -3.52688 2.446394
H  -2.107162 1.978878 -0.462544
H  -4.114982 0.680799 1.421369
H  -3.6937 2.376479 1.367854
H  -5.178134 0.820592 -0.802402
H  -5.854871 1.950589 0.337392
H  -3.790248 2.65163 -1.804614
H  -4.468866 3.791342 -0.665733
H  -6.054371 2.21966 -2.736477
H  -1.739385 0.020915 1.844093
H  -1.481937 1.753487 1.942599
H  -3.189314 0.090248 -1.64219
H  -1.563602 -0.372016 -1.165218
H  -2.946722 -0.952595 -0.243824
H  -7.496734 2.855858 -0.816171
H  -7.896665 3.828751 -2.220172
H  -6.927332 4.519651 -0.922913
H  -6.186543 4.380031 -3.96897
H  -5.15837 5.141937 -2.759878
H  -4.513192 3.863934 -3.78508
H  0.384907 1.601761 0.271052
H  0.23167 -1.221758 1.419679
H  2.772584 1.450404 0.467574
H  2.162315 0.906959 -1.084207
H  3.746133 0.36645 -0.52402
H  2.011269 -2.524132 1.170186
H  5.834286 -3.756435 -0.497922
H  5.242105 -5.149421 0.413941
H  7.741166 -3.307972 3.245365
totalener: -853.22996072 hartree
nucrepener: 1408.87378761 hartree
electener: -2262.10374833 hartree
oneelecener: -3951.76293734 hartree
twoeener: 1689.65918900 hartree
kineticenergy: 849.18557391 hartree
xcener: -85.610571887610 hartree
chargesum: -0.0000000
charge: -0.261718 -0.383213 0.083250 -0.196635 -0.134650 -0.153248 0.048211 -0.121231 -0.308482 -0.274899 -0.260919 -0.132772 -0.092316 0.040367 -0.265831 -0.164175 0.419219 -0.012803 -0.367062 0.071818 0.044324 0.078651 0.072633 0.070264 0.080968 0.064523 0.067985 0.026854 0.069747 0.089402 0.086066 0.099340 0.080856 0.083291 0.083445 0.077696 0.082729 0.075929 0.080095 0.096830 0.073474 0.093386 0.088492 0.122404 0.095620 0.125960 0.115983 0.240144
qa: -0.2617 -0.3832 0.0833 -0.1966 -0.1346 -0.1532 0.0482 -0.1212 -0.3085 -0.2749 -0.2609 -0.1328 -0.0923 0.0404 -0.2658 -0.1642 0.4192 -0.0128 -0.3671 0.0718 0.0443 0.0787 0.0726 0.0703 0.0810 0.0645 0.0680 0.0269 0.0697 0.0894 0.0861 0.0993 0.0809 0.0833 0.0834 0.0777 0.0827 0.0759 0.0801 0.0968 0.0735 0.0934 0.0885 0.1224 0.0956 0.1260 0.1160 0.2401
va: 2.1316 2.1197 3.7303 3.9308 3.8823 3.8648 3.8597 3.9425 3.9612 3.9372 3.9346 3.9076 3.9587 3.6762 3.9260 3.7947 4.2191 3.9814 3.7991 3.6783 1.0182 1.0108 1.0112 1.0055 1.0149 1.0147 1.0144 1.0168 1.0207 1.0084 1.0036 1.0062 1.0052 1.0062 1.0076 1.0049 1.0080 1.0055 1.0076 1.0119 1.0318 0.9977 0.9971 1.0389 1.0362 1.0026 0.9850 0.9743
dispcorr: -0.018712650 hartree
energy: -853.248673374744
dipole: -50.74814 49.76910 -0.97904 28.21997 -28.09662 0.12335 -11.43260 11.52439 0.09179
magnitude: 0.99104 au
magnitude: 2.51902 debye
