program: Orca
programVersion: 5.0.2
elementType: O O C C C C C C C C C C C C C C C C C C H H H H H H H H H H H H H H H H H H H H H H H H H H H H
charge: 0
multiplicity: 1
keywords: wb97x-d3
keywords: def2-TZVPP
keywords: def2/J RIJCOSX
keywords: DEFGRID2
keywords: scfconv7
keywords: smallprint printgap noloewdin
keywords: NOSOSCF
formula: C18H28O2
InChI: InChI=1/C18H28O2/c1-6-13-20-18(19)14-17(5)12-8-11-16(4)10-7-9-15(2)3/h1,8,12,14-16H,7,9-11,13H2,2-5H3
48 atoms
O  4.326373 -1.532803 -0.322881
O  3.583999 -2.117013 1.702405
C  -3.59817 -0.190987 -0.548919
C  -2.779833 1.080752 -0.770275
C  -3.57319 2.374562 -0.626905
C  -2.739731 3.607013 -0.957423
C  -3.50571 4.931244 -0.940468
C  -2.777029 -1.445049 -0.901985
C  -4.176607 -0.274825 0.860806
C  -4.092864 5.243829 0.432444
C  -2.602032 6.070093 -1.401665
C  -1.608534 -1.679595 -0.003925
C  -0.33205 -1.60737 -0.389932
C  0.829533 -1.816416 0.471097
C  0.577179 -2.156486 1.906456
C  2.044579 -1.675588 -0.095121
C  3.349614 -1.814068 0.562398
C  5.659797 -1.62882 0.150428
C  6.126794 -3.005801 0.238368
C  6.54234 -4.128721 0.29676
H  -4.439362 -0.171945 -1.252189
H  -1.930959 1.095033 -0.078022
H  -2.342467 1.045333 -1.774522
H  -4.448848 2.340142 -1.285706
H  -3.962401 2.456314 0.390901
H  -2.293346 3.474528 -1.949059
H  -1.897343 3.67356 -0.25831
H  -4.33519 4.847042 -1.653267
H  -2.437253 -1.370913 -1.938694
H  -3.439974 -2.315888 -0.853522
H  -4.674705 -1.231631 1.028845
H  -3.40211 -0.164998 1.622709
H  -4.91609 0.505352 1.038756
H  -3.307471 5.285433 1.191165
H  -4.820997 4.497952 0.751455
H  -4.599855 6.209913 0.432333
H  -3.141158 7.017798 -1.440376
H  -1.75887 6.19981 -0.719247
H  -2.194071 5.881341 -2.395912
H  -1.839237 -1.919665 1.029219
H  -0.119211 -1.368327 -1.428157
H  1.489374 -2.29581 2.47235
H  -0.012795 -3.072342 1.974909
H  -0.006999 -1.366048 2.38157
H  2.090217 -1.422739 -1.147785
H  5.77098 -1.139113 1.120906
H  6.26387 -1.081949 -0.574274
H  6.897392 -5.129109 0.355324
totalener: -853.22971812 hartree
nucrepener: 1432.71416857 hartree
electener: -2285.94388668 hartree
oneelecener: -3999.51143272 hartree
twoeener: 1713.56754604 hartree
kineticenergy: 849.18806907 hartree
xcener: -85.610922284024 hartree
chargesum: 0.0000000
charge: -0.262165 -0.381984 0.123980 -0.184568 -0.112209 -0.151970 0.057314 -0.156717 -0.323468 -0.278236 -0.267396 -0.127756 -0.091013 0.042580 -0.266848 -0.164459 0.420384 -0.012527 -0.365301 0.068641 0.041842 0.072956 0.063133 0.060141 0.064800 0.062956 0.063698 0.025355 0.078770 0.096463 0.093307 0.079833 0.091306 0.078930 0.081557 0.083896 0.082232 0.076274 0.080451 0.101386 0.072509 0.124582 0.092802 0.088155 0.095048 0.125273 0.115993 0.240070
qa: -0.2622 -0.3820 0.1240 -0.1846 -0.1122 -0.1520 0.0573 -0.1567 -0.3235 -0.2782 -0.2674 -0.1278 -0.0910 0.0426 -0.2668 -0.1645 0.4204 -0.0125 -0.3653 0.0686 0.0418 0.0730 0.0631 0.0601 0.0648 0.0630 0.0637 0.0254 0.0788 0.0965 0.0933 0.0798 0.0913 0.0789 0.0816 0.0839 0.0822 0.0763 0.0805 0.1014 0.0725 0.1246 0.0928 0.0882 0.0950 0.1253 0.1160 0.2401
va: 2.1315 2.1207 3.7236 3.9416 3.8709 3.9016 3.8463 3.9495 3.9677 3.9345 3.9435 3.8705 3.9430 3.6776 3.9228 3.8008 4.2131 3.9874 3.7872 3.6858 1.0176 1.0091 1.0163 1.0109 1.0078 1.0151 1.0136 1.0166 1.0161 1.0065 1.0046 0.9978 1.0050 1.0048 1.0052 1.0078 1.0076 1.0056 1.0075 1.0021 1.0317 1.0391 0.9976 0.9976 1.0360 1.0005 0.9853 0.9744
dispcorr: -0.018701479 hartree
energy: -853.248419594447
dipole: -41.21699 40.39398 -0.82300 29.02071 -28.69765 0.32305 -2.60834 2.10932 -0.49903
magnitude: 1.01525 au
magnitude: 2.58055 debye
