program: Orca
programVersion: 5.0.2
elementType: O O C C C C C C C C C C C C C C C C C C H H H H H H H H H H H H H H H H H H H H H H H H H H H H
charge: 0
multiplicity: 1
keywords: wb97x-d3
keywords: def2-TZVPP
keywords: def2/J RIJCOSX
keywords: DEFGRID2
keywords: scfconv7
keywords: smallprint printgap noloewdin
keywords: NOSOSCF
formula: C18H28O2
InChI: InChI=1/C18H28O2/c1-6-13-20-18(19)14-17(5)12-8-11-16(4)10-7-9-15(2)3/h1,8,12,14-16H,7,9-11,13H2,2-5H3
48 atoms
O  4.86644 -1.812143 0.074594
O  3.729227 -3.631957 0.699316
C  -2.982929 0.23976 0.376058
C  -4.109782 1.174144 -0.076234
C  -3.684676 2.572968 -0.510708
C  -4.880212 3.439733 -0.892122
C  -4.537838 4.882545 -1.266199
C  -1.985638 -0.0417 -0.758506
C  -2.272146 0.748366 1.62548
C  -3.668057 4.961562 -2.516757
C  -5.811477 5.700952 -1.451523
C  -1.017865 -1.122316 -0.412839
C  0.308141 -0.970099 -0.377297
C  1.276171 -2.001695 -0.014339
C  0.746699 -3.348372 0.367623
C  2.578049 -1.654931 -0.047626
C  3.72837 -2.500809 0.290958
C  6.0795 -2.470987 0.401323
C  6.348698 -2.458173 1.833323
C  6.601364 -2.433263 3.005246
H  -3.457986 -0.715173 0.633072
H  -4.651636 0.698188 -0.900957
H  -4.832395 1.261953 0.742019
H  -3.132224 3.066784 0.294946
H  -2.994699 2.502604 -1.355597
H  -5.583796 3.452305 -0.052557
H  -5.418848 2.97313 -1.725827
H  -3.975139 5.320123 -0.432531
H  -1.441889 0.870378 -1.019212
H  -2.547213 -0.337761 -1.652539
H  -1.706002 1.66005 1.426027
H  -2.985817 0.969512 2.420565
H  -1.566116 0.012704 2.010848
H  -2.710254 4.456936 -2.388808
H  -3.453015 5.997837 -2.781727
H  -4.172565 4.50296 -3.370756
H  -6.412808 5.307848 -2.274583
H  -6.432123 5.685689 -0.554204
H  -5.586104 6.743807 -1.679402
H  -1.456224 -2.084737 -0.162356
H  0.721593 0.002243 -0.629901
H  1.529123 -4.050202 0.626914
H  0.163567 -3.767694 -0.454488
H  0.07216 -3.256105 1.22079
H  2.82898 -0.644866 -0.348904
H  6.859976 -1.919994 -0.124367
H  6.084334 -3.499647 0.033286
H  6.812864 -2.420768 4.047242
totalener: -853.22975090 hartree
nucrepener: 1411.57398932 hartree
electener: -2264.80374022 hartree
oneelecener: -3957.18572257 hartree
twoeener: 1692.38198235 hartree
kineticenergy: 849.19124425 hartree
xcener: -85.611451085352 hartree
chargesum: -0.0000000
charge: -0.262117 -0.382814 0.089262 -0.169176 -0.124292 -0.160307 0.058536 -0.119301 -0.309600 -0.276084 -0.265683 -0.168674 -0.068773 0.035052 -0.266182 -0.163958 0.421364 -0.011044 -0.365104 0.067590 0.051328 0.073624 0.074280 0.067248 0.066652 0.064328 0.062745 0.025044 0.061822 0.093253 0.074830 0.092723 0.097548 0.081243 0.084587 0.077485 0.076017 0.080385 0.082400 0.099065 0.072759 0.123120 0.091389 0.090664 0.094977 0.115972 0.125719 0.240100
qa: -0.2621 -0.3828 0.0893 -0.1692 -0.1243 -0.1603 0.0585 -0.1193 -0.3096 -0.2761 -0.2657 -0.1687 -0.0688 0.0351 -0.2662 -0.1640 0.4214 -0.0110 -0.3651 0.0676 0.0513 0.0736 0.0743 0.0672 0.0667 0.0643 0.0627 0.0250 0.0618 0.0933 0.0748 0.0927 0.0975 0.0812 0.0846 0.0775 0.0760 0.0804 0.0824 0.0991 0.0728 0.1231 0.0914 0.0907 0.0950 0.1160 0.1257 0.2401
va: 2.1316 2.1197 3.7657 3.9074 3.8595 3.9059 3.8459 3.9519 3.9571 3.9318 3.9403 3.9425 3.9465 3.6862 3.9238 3.7981 4.2157 3.9826 3.7918 3.6868 1.0161 1.0106 1.0130 1.0078 1.0087 1.0145 1.0143 1.0171 1.0170 1.0060 1.0020 1.0050 1.0058 1.0058 1.0077 1.0051 1.0055 1.0075 1.0077 1.0110 1.0302 1.0393 0.9968 0.9982 1.0362 0.9852 1.0013 0.9743
dispcorr: -0.018546209 hartree
energy: -853.248297105012
dipole: -46.27921 45.60658 -0.67263 30.43178 -29.80997 0.62181 -7.80164 7.54834 -0.25330
magnitude: 0.95039 au
magnitude: 2.41570 debye
