program: Orca
programVersion: 5.0.2
elementType: O O C C C C C C C C C C C C C C C C C C H H H H H H H H H H H H H H H H H H H H H H H H H H H H
charge: 0
multiplicity: 1
keywords: wb97x-d3
keywords: def2-TZVPP
keywords: def2/J RIJCOSX
keywords: DEFGRID2
keywords: scfconv7
keywords: smallprint printgap noloewdin
keywords: NOSOSCF
formula: C18H28O2
InChI: InChI=1/C18H28O2/c1-6-13-20-18(19)14-17(5)12-8-11-16(4)10-7-9-15(2)3/h1,8,12,14-16H,7,9-11,13H2,2-5H3
48 atoms
O  4.672239 -1.885434 1.334295
O  3.677639 -3.749582 0.603021
C  -3.018466 0.143418 -0.165181
C  -4.070652 1.156968 -0.62512
C  -3.713619 2.627299 -0.432674
C  -4.82029 3.549888 -0.93065
C  -4.508064 5.044485 -0.843039
C  -1.718011 0.265646 -0.975499
C  -2.746352 0.222189 1.332931
C  -5.608012 5.854988 -1.520833
C  -4.316135 5.510916 0.596436
C  -0.798932 -0.889234 -0.765097
C  0.429131 -0.800382 -0.248278
C  1.345876 -1.917229 -0.033953
C  0.877048 -3.285076 -0.419469
C  2.550463 -1.624752 0.495235
C  3.642125 -2.561657 0.787715
C  5.838958 -2.633266 1.636366
C  6.651293 -2.890731 0.454265
C  7.346001 -3.089137 -0.502548
H  -3.436247 -0.849523 -0.372758
H  -4.287209 0.980241 -1.684556
H  -5.005485 0.950106 -0.093153
H  -3.515044 2.821564 0.62436
H  -2.787299 2.864946 -0.966526
H  -5.742952 3.345626 -0.373714
H  -5.041546 3.298851 -1.974074
H  -3.572565 5.223965 -1.387101
H  -1.204308 1.199115 -0.729522
H  -1.97367 0.321123 -2.040158
H  -2.269709 1.164965 1.607576
H  -3.671488 0.141269 1.90566
H  -2.083369 -0.578963 1.660086
H  -5.386748 6.923209 -1.50247
H  -6.56705 5.709983 -1.01797
H  -5.736402 5.562492 -2.564307
H  -4.122699 6.583845 0.639489
H  -5.211698 5.315028 1.191256
H  -3.478922 5.013285 1.086222
H  -1.191687 -1.860036 -1.055038
H  0.797319 0.180395 0.039198
H  -0.026829 -3.540902 0.136588
H  1.620208 -4.050701 -0.236184
H  0.614965 -3.306272 -1.478856
H  2.764458 -0.589474 0.732962
H  5.590159 -3.576703 2.128312
H  6.401056 -2.02147 2.343097
H  7.948701 -3.270322 -1.359666
totalener: -853.22977924 hartree
nucrepener: 1407.56860329 hartree
electener: -2260.79838253 hartree
oneelecener: -3949.16624427 hartree
twoeener: 1688.36786174 hartree
kineticenergy: 849.18608697 hartree
xcener: -85.610262351538 hartree
chargesum: 0.0000000
charge: -0.261794 -0.382826 0.091797 -0.165049 -0.126795 -0.159199 0.057907 -0.124941 -0.314820 -0.265756 -0.274692 -0.156787 -0.077255 0.038370 -0.265559 -0.164300 0.420970 -0.010957 -0.366505 0.069052 0.050967 0.071716 0.075799 0.069424 0.064731 0.062297 0.064072 0.024512 0.065129 0.092687 0.073734 0.093194 0.098313 0.082702 0.075836 0.080289 0.084173 0.077618 0.081503 0.096574 0.073299 0.089600 0.123786 0.090815 0.094673 0.126031 0.115683 0.239982
qa: -0.2618 -0.3828 0.0918 -0.1650 -0.1268 -0.1592 0.0579 -0.1249 -0.3148 -0.2658 -0.2747 -0.1568 -0.0773 0.0384 -0.2656 -0.1643 0.4210 -0.0110 -0.3665 0.0691 0.0510 0.0717 0.0758 0.0694 0.0647 0.0623 0.0641 0.0245 0.0651 0.0927 0.0737 0.0932 0.0983 0.0827 0.0758 0.0803 0.0842 0.0776 0.0815 0.0966 0.0733 0.0896 0.1238 0.0908 0.0947 0.1260 0.1157 0.2400
va: 2.1314 2.1201 3.7586 3.9038 3.8620 3.9040 3.8477 3.9535 3.9605 3.9407 3.9330 3.9275 3.9539 3.6795 3.9253 3.7968 4.2174 3.9838 3.7929 3.6846 1.0163 1.0119 1.0122 1.0041 1.0110 1.0144 1.0142 1.0173 1.0164 1.0066 1.0016 1.0046 1.0058 1.0076 1.0056 1.0075 1.0076 1.0053 1.0055 1.0119 1.0307 0.9976 1.0391 0.9978 1.0364 1.0014 0.9853 0.9744
dispcorr: -0.018506780 hartree
energy: -853.248286021411
dipole: -47.60020 46.92139 -0.67881 31.74106 -31.06770 0.67336 -4.44606 4.39459 -0.05148
magnitude: 0.95752 au
magnitude: 2.43382 debye
