program: Orca
programVersion: 5.0.2
elementType: O O C C C C C C C C C C C C C C C C C C H H H H H H H H H H H H H H H H H H H H H H H H H H H H
charge: 0
multiplicity: 1
keywords: wb97x-d3
keywords: def2-TZVPP
keywords: def2/J RIJCOSX
keywords: DEFGRID2
keywords: scfconv7
keywords: smallprint printgap noloewdin
keywords: NOSOSCF
formula: C18H28O2
InChI: InChI=1/C18H28O2/c1-6-13-20-18(19)14-17(5)12-8-11-16(4)10-7-9-15(2)3/h1,8,12,14-16H,7,9-11,13H2,2-5H3
48 atoms
O  4.15073 -2.821822 1.7821
O  4.028914 -2.724867 -0.448864
C  -3.164795 0.280306 0.073542
C  -4.318037 1.115706 0.6364
C  -4.365438 2.582046 0.212806
C  -4.493205 2.784495 -1.292721
C  -4.738289 4.23253 -1.721588
C  -1.802534 0.863003 0.475448
C  -3.297574 -1.167598 0.53277
C  -3.56025 5.139642 -1.378847
C  -5.045012 4.300599 -3.213983
C  -0.645749 0.131458 -0.115934
C  0.315529 -0.466724 0.592099
C  1.468707 -1.174226 0.041952
C  1.593397 -1.250796 -1.447255
C  2.339308 -1.700572 0.926368
C  3.56629 -2.447917 0.626287
C  5.369754 -3.539121 1.680974
C  6.510078 -2.670541 1.420083
C  7.467522 -1.973218 1.234308
H  -3.227936 0.292751 -1.021249
H  -5.259765 0.638407 0.344994
H  -4.283883 1.06194 1.730315
H  -5.223738 3.050321 0.705254
H  -3.488512 3.111297 0.59501
H  -5.318327 2.162992 -1.659061
H  -3.59458 2.417007 -1.802163
H  -5.618614 4.598079 -1.178751
H  -1.721307 0.876375 1.567356
H  -1.747413 1.906478 0.146813
H  -3.222135 -1.24081 1.620415
H  -4.262862 -1.584256 0.241724
H  -2.520388 -1.803729 0.109075
H  -3.741486 6.162914 -1.711026
H  -2.647676 4.793156 -1.870425
H  -3.364336 5.178981 -0.307129
H  -5.256224 5.322493 -3.532411
H  -4.198707 3.941662 -3.804254
H  -5.910197 3.688385 -3.473434
H  -0.611779 0.104073 -1.201742
H  0.254505 -0.428276 1.67608
H  0.701656 -1.712221 -1.875348
H  2.459791 -1.815198 -1.767738
H  1.664219 -0.245689 -1.867491
H  2.133509 -1.570579 1.982247
H  5.312196 -4.312583 0.911431
H  5.497452 -4.031505 2.645649
H  8.310992 -1.35076 1.057323
totalener: -853.22991740 hartree
nucrepener: 1425.36150592 hartree
electener: -2278.59142332 hartree
oneelecener: -3984.72121257 hartree
twoeener: 1706.12978925 hartree
kineticenergy: 849.18370434 hartree
xcener: -85.610299289277 hartree
chargesum: 0.0000000
charge: -0.261845 -0.383005 0.075036 -0.196692 -0.124364 -0.154611 0.048147 -0.138469 -0.290861 -0.275189 -0.260676 -0.143238 -0.072574 0.033691 -0.266835 -0.163578 0.419980 -0.011407 -0.366249 0.069423 0.044184 0.074755 0.078219 0.078417 0.064596 0.072599 0.057245 0.025886 0.076604 0.094291 0.076576 0.087028 0.095045 0.085278 0.076282 0.084491 0.082930 0.075609 0.080360 0.100523 0.071872 0.087189 0.124223 0.093217 0.094654 0.125631 0.115737 0.239878
qa: -0.2618 -0.3830 0.0750 -0.1967 -0.1244 -0.1546 0.0481 -0.1385 -0.2909 -0.2752 -0.2607 -0.1432 -0.0726 0.0337 -0.2668 -0.1636 0.4200 -0.0114 -0.3662 0.0694 0.0442 0.0748 0.0782 0.0784 0.0646 0.0726 0.0572 0.0259 0.0766 0.0943 0.0766 0.0870 0.0950 0.0853 0.0763 0.0845 0.0829 0.0756 0.0804 0.1005 0.0719 0.0872 0.1242 0.0932 0.0947 0.1256 0.1157 0.2399
va: 2.1311 2.1200 3.7439 3.9264 3.8586 3.8655 3.8617 3.9200 3.9559 3.9325 3.9376 3.9087 3.9509 3.6883 3.9253 3.7959 4.2173 3.9852 3.7924 3.6828 1.0181 1.0105 1.0118 1.0127 1.0075 1.0134 1.0131 1.0177 1.0191 1.0056 1.0077 1.0069 1.0042 1.0083 1.0059 1.0056 1.0082 1.0054 1.0078 1.0106 1.0327 0.9976 1.0390 0.9974 1.0364 1.0014 0.9852 0.9744
dispcorr: -0.019005464 hartree
energy: -853.248922862313
dipole: -45.73384 44.81120 -0.92264 27.20685 -26.78653 0.42032 -11.07707 11.37066 0.29359
magnitude: 1.05552 au
magnitude: 2.68293 debye
