program: Orca
programVersion: 5.0.2
elementType: O O C C C C C C C C C C C C C C C C C C H H H H H H H H H H H H H H H H H H H H H H H H H H H H
charge: 0
multiplicity: 1
keywords: wb97x-d3
keywords: def2-TZVPP
keywords: def2/J RIJCOSX
keywords: DEFGRID2
keywords: scfconv7
keywords: smallprint printgap noloewdin
keywords: NOSOSCF
formula: C18H28O2
InChI: InChI=1/C18H28O2/c1-6-13-20-18(19)14-17(5)12-8-11-16(4)10-7-9-15(2)3/h1,8,12,14-16H,7,9-11,13H2,2-5H3
48 atoms
O  3.318477 -1.368758 1.49451
O  3.079726 -1.728458 -0.699248
C  -4.310129 -0.046739 0.107031
C  -3.418692 1.111049 0.580666
C  -2.381093 1.589151 -0.431047
C  -1.464746 2.660062 0.152549
C  -0.3015 3.103957 -0.74138
C  -3.70097 -1.423701 0.436308
C  -5.701135 0.043149 0.727259
C  0.71295 1.986927 -0.969757
C  -0.778947 3.686245 -2.067842
C  -2.362557 -1.65197 -0.175659
C  -1.217822 -1.711488 0.509875
C  0.114624 -1.801911 -0.079357
C  0.207638 -2.01026 -1.558386
C  1.162701 -1.645051 0.753603
C  2.582814 -1.59923 0.388221
C  4.715045 -1.210046 1.308833
C  5.055653 0.109306 0.79244
C  5.351657 1.200547 0.393716
H  -4.422053 0.0248 -0.981966
H  -4.051201 1.964247 0.847409
H  -2.915779 0.820409 1.510652
H  -1.783919 0.744423 -0.777996
H  -2.902373 1.976341 -1.31197
H  -1.049775 2.289504 1.096292
H  -2.065907 3.537649 0.415155
H  0.21411 3.904344 -0.198565
H  -4.392324 -2.198688 0.088135
H  -3.636765 -1.528309 1.523941
H  -6.341325 -0.780021 0.405892
H  -5.646323 0.011763 1.817721
H  -6.196102 0.974642 0.450559
H  1.58954 2.354488 -1.504993
H  0.296238 1.172729 -1.565357
H  1.059628 1.557027 -0.028835
H  0.054753 4.1044 -2.633959
H  -1.244966 2.925701 -2.697217
H  -1.508421 4.484475 -1.917799
H  -2.343906 -1.723096 -1.259497
H  -1.258467 -1.624232 1.592011
H  1.226321 -2.140108 -1.90092
H  -0.218532 -1.153679 -2.085702
H  -0.37533 -2.884929 -1.850901
H  0.958464 -1.497343 1.807449
H  5.119106 -1.982033 0.649802
H  5.1567 -1.344221 2.29679
H  5.605232 2.165539 0.026798
totalener: -853.22591148 hartree
nucrepener: 1549.98401173 hartree
electener: -2403.20992322 hartree
oneelecener: -4234.21051554 hartree
twoeener: 1831.00059233 hartree
kineticenergy: 849.19118765 hartree
xcener: -85.612652248939 hartree
chargesum: -0.0000000
charge: -0.261856 -0.382667 0.067790 -0.176526 -0.107010 -0.152483 0.073754 -0.144746 -0.279612 -0.290045 -0.289673 -0.087373 -0.116266 0.036492 -0.266322 -0.188717 0.435583 -0.009282 -0.361441 0.062517 0.039722 0.076632 0.062555 0.031522 0.075017 0.069327 0.074887 0.037919 0.084638 0.073406 0.080669 0.084412 0.083633 0.092382 0.062524 0.089310 0.087795 0.073387 0.085494 0.108463 0.073917 0.127470 0.084526 0.102454 0.094506 0.126166 0.116304 0.238845
qa: -0.2619 -0.3827 0.0678 -0.1765 -0.1070 -0.1525 0.0738 -0.1447 -0.2796 -0.2900 -0.2897 -0.0874 -0.1163 0.0365 -0.2663 -0.1887 0.4356 -0.0093 -0.3614 0.0625 0.0397 0.0766 0.0626 0.0315 0.0750 0.0693 0.0749 0.0379 0.0846 0.0734 0.0807 0.0844 0.0836 0.0924 0.0625 0.0893 0.0878 0.0734 0.0855 0.1085 0.0739 0.1275 0.0845 0.1025 0.0945 0.1262 0.1163 0.2388
va: 2.1268 2.1150 3.7552 3.9210 3.8326 3.8993 3.8462 3.9592 3.9509 3.9774 3.9469 3.8500 3.9214 3.6395 3.9121 3.7868 4.1921 3.9827 3.7862 3.6978 1.0208 1.0084 1.0136 1.0315 1.0114 1.0124 1.0096 1.0094 1.0107 1.0143 1.0076 1.0018 1.0062 1.0111 0.9979 1.0046 1.0077 0.9999 1.0046 1.0047 1.0314 1.0382 0.9955 0.9984 1.0372 1.0017 0.9850 0.9754
dispcorr: -0.022761103 hartree
energy: -853.248672585724
dipole: -29.26372 28.48604 -0.77768 15.54514 -15.42681 0.11834 -6.55517 6.88902 0.33386
magnitude: 0.85455 au
magnitude: 2.17209 debye
