program: Orca
programVersion: 5.0.2
elementType: O O C C C C C C C C C C C C C C C C C C H H H H H H H H H H H H H H H H H H H H H H H H H H H H
charge: 0
multiplicity: 1
keywords: wb97x-d3
keywords: def2-TZVPP
keywords: def2/J RIJCOSX
keywords: DEFGRID2
keywords: scfconv7
keywords: smallprint printgap noloewdin
keywords: NOSOSCF
formula: C18H28O2
InChI: InChI=1/C18H28O2/c1-6-13-20-18(19)14-17(5)12-8-11-16(4)10-7-9-15(2)3/h1,8,12,14-16H,7,9-11,13H2,2-5H3
48 atoms
O  3.785794 -0.317081 0.572428
O  3.286162 -2.053026 -0.744031
C  -4.284762 -0.546693 0.109387
C  -3.671219 0.416249 -0.912426
C  -3.066698 1.692924 -0.339013
C  -2.386984 2.536765 -1.411503
C  -1.753043 3.834481 -0.907235
C  -3.269503 -1.021789 1.162241
C  -5.513661 0.037415 0.797681
C  -0.629246 3.574229 0.092196
C  -1.23847 4.663622 -2.07941
C  -2.022847 -1.581979 0.566559
C  -0.802221 -1.07929 0.76937
C  0.438291 -1.57349 0.178856
C  0.355076 -2.772454 -0.712509
C  1.566213 -0.901401 0.48391
C  2.9261 -1.193898 0.016562
C  5.160864 -0.498925 0.27628
C  5.75303 -1.587439 1.042892
C  6.259113 -2.464228 1.684788
H  -4.610576 -1.431721 -0.45044
H  -2.892676 -0.11175 -1.47237
H  -4.438685 0.678418 -1.648263
H  -3.837366 2.291449 0.157603
H  -2.337824 1.433187 0.431998
H  -3.120129 2.779397 -2.18856
H  -1.614275 1.935313 -1.905211
H  -2.532117 4.416095 -0.399247
H  -3.75201 -1.790422 1.77622
H  -3.02218 -0.202833 1.843405
H  -5.987535 -0.697013 1.451027
H  -5.260158 0.902372 1.413074
H  -6.259576 0.358225 0.069122
H  0.146232 2.942601 -0.348484
H  -0.984865 3.078023 0.995513
H  -0.155691 4.506552 0.403627
H  -0.454814 4.129891 -2.62215
H  -2.034718 4.890145 -2.790212
H  -0.816535 5.61203 -1.743374
H  -2.151305 -2.441106 -0.086296
H  -0.704411 -0.216369 1.422637
H  -0.295459 -2.562007 -1.563626
H  -0.09073 -3.60908 -0.171455
H  1.320621 -3.083347 -1.090806
H  1.48765 -0.051232 1.151282
H  5.641929 0.442884 0.541844
H  5.317808 -0.670436 -0.791175
H  6.697244 -3.2508 2.250109
totalener: -853.22959581 hartree
nucrepener: 1495.35639231 hartree
electener: -2348.58598812 hartree
oneelecener: -4124.80162689 hartree
twoeener: 1776.21563877 hartree
kineticenergy: 849.19018124 hartree
xcener: -85.612517330290 hartree
chargesum: 0.0000000
charge: -0.261904 -0.382632 0.057442 -0.139407 -0.130816 -0.155028 0.062549 -0.157032 -0.301368 -0.281230 -0.266755 -0.106917 -0.104372 0.046875 -0.265807 -0.170458 0.420051 -0.010721 -0.365888 0.067448 0.054359 0.074894 0.081620 0.074768 0.039861 0.065877 0.064651 0.023378 0.094042 0.073017 0.087774 0.078187 0.088761 0.081426 0.080714 0.085791 0.077107 0.079738 0.081630 0.103885 0.071660 0.089268 0.092444 0.123409 0.095155 0.116603 0.125768 0.240184
qa: -0.2619 -0.3826 0.0574 -0.1394 -0.1308 -0.1550 0.0625 -0.1570 -0.3014 -0.2812 -0.2668 -0.1069 -0.1044 0.0469 -0.2658 -0.1705 0.4201 -0.0107 -0.3659 0.0674 0.0544 0.0749 0.0816 0.0748 0.0399 0.0659 0.0647 0.0234 0.0940 0.0730 0.0878 0.0782 0.0888 0.0814 0.0807 0.0858 0.0771 0.0797 0.0816 0.1039 0.0717 0.0893 0.0924 0.1234 0.0952 0.1166 0.1258 0.2402
va: 2.1305 2.1198 3.8154 3.8801 3.8630 3.8995 3.8487 3.9381 3.9600 3.9329 3.9411 3.8569 3.9359 3.6601 3.9234 3.7934 4.2179 3.9808 3.7875 3.6889 1.0114 1.0124 1.0101 1.0119 1.0169 1.0139 1.0151 1.0168 1.0093 1.0063 1.0062 1.0004 1.0057 1.0051 1.0031 1.0091 1.0053 1.0075 1.0079 1.0069 1.0296 0.9983 0.9974 1.0387 1.0370 0.9851 1.0013 0.9743
dispcorr: -0.020306109 hartree
energy: -853.249901922677
dipole: -34.54495 33.69122 -0.85372 18.89959 -18.55052 0.34908 -5.19494 5.43748 0.24254
magnitude: 0.95369 au
magnitude: 2.42408 debye
