program: Orca
programVersion: 5.0.2
elementType: O O C C C C C C C C C C C C C C C C C C H H H H H H H H H H H H H H H H H H H H H H H H H H H H
charge: 0
multiplicity: 1
keywords: wb97x-d3
keywords: def2-TZVPP
keywords: def2/J RIJCOSX
keywords: DEFGRID2
keywords: scfconv7
keywords: smallprint printgap noloewdin
keywords: NOSOSCF
formula: C18H28O2
InChI: InChI=1/C18H28O2/c1-6-13-20-18(19)14-17(5)12-8-11-16(4)10-7-9-15(2)3/h1,8,12,14-16H,7,9-11,13H2,2-5H3
48 atoms
O  3.744828 -0.281349 0.565103
O  3.260943 -2.020014 -0.753787
C  -4.304116 -0.545617 0.104941
C  -3.671654 0.411432 -0.910828
C  -3.048818 1.676231 -0.330949
C  -2.327991 2.497933 -1.393824
C  -1.656263 3.772442 -0.879398
C  -3.299837 -1.042087 1.159029
C  -5.524839 0.055996 0.792606
C  -0.543349 3.471093 0.120886
C  -1.112446 4.593045 -2.044439
C  -2.051101 -1.599389 0.564873
C  -0.832364 -1.095773 0.77634
C  0.411194 -1.57621 0.18127
C  0.337071 -2.771468 -0.71577
C  1.532764 -0.893228 0.485558
C  2.893971 -1.167878 0.011424
C  5.120583 -0.443481 0.261106
C  5.732119 -1.521583 1.026851
C  6.254508 -2.390628 1.666886
H  -4.6426 -1.422588 -0.45994
H  -2.899438 -0.127103 -1.469462
H  -4.431653 0.688252 -1.649016
H  -3.814716 2.295079 0.147725
H  -2.3412 1.403947 0.455264
H  -3.042707 2.765656 -2.17975
H  -1.569836 1.871078 -1.878409
H  -2.418493 4.374623 -0.369824
H  -3.791735 -1.815908 1.75877
H  -3.052789 -0.233948 1.853105
H  -5.257847 0.913714 1.412414
H  -6.263296 0.392808 0.063669
H  -6.012882 -0.673029 1.44159
H  0.215197 2.822042 -0.323905
H  -0.915214 2.976461 1.018599
H  -0.044558 4.386629 0.442563
H  -0.345622 4.038046 -2.589867
H  -1.899587 4.850874 -2.754713
H  -0.660348 5.524567 -1.700489
H  -2.17618 -2.452205 -0.096862
H  -0.739332 -0.238649 1.437888
H  -0.108179 -3.612208 -0.180756
H  1.305568 -3.076669 -1.091203
H  -0.31012 -2.559564 -1.569124
H  1.447183 -0.0467 1.156707
H  5.589223 0.505759 0.522329
H  5.273941 -0.614762 -0.806924
H  6.706984 -3.170008 2.230978
totalener: -853.22940783 hartree
nucrepener: 1499.93879373 hartree
electener: -2353.16820157 hartree
oneelecener: -4133.96744835 hartree
twoeener: 1780.79924678 hartree
kineticenergy: 849.18983614 hartree
xcener: -85.612537288870 hartree
chargesum: 0.0000000
charge: -0.261809 -0.382817 0.056338 -0.138385 -0.132435 -0.153977 0.063090 -0.156578 -0.301671 -0.281749 -0.266664 -0.105298 -0.107661 0.049678 -0.265951 -0.172144 0.420358 -0.010761 -0.365667 0.067205 0.054782 0.074168 0.082095 0.075408 0.039228 0.066307 0.064542 0.023193 0.093863 0.072781 0.078364 0.088615 0.087969 0.081167 0.080340 0.086354 0.077205 0.079691 0.081560 0.104410 0.071800 0.092452 0.123403 0.089375 0.095152 0.116621 0.125821 0.240233
qa: -0.2618 -0.3828 0.0563 -0.1384 -0.1324 -0.1540 0.0631 -0.1566 -0.3017 -0.2817 -0.2667 -0.1053 -0.1077 0.0497 -0.2660 -0.1721 0.4204 -0.0108 -0.3657 0.0672 0.0548 0.0742 0.0821 0.0754 0.0392 0.0663 0.0645 0.0232 0.0939 0.0728 0.0784 0.0886 0.0880 0.0812 0.0803 0.0864 0.0772 0.0797 0.0816 0.1044 0.0718 0.0925 0.1234 0.0894 0.0952 0.1166 0.1258 0.2402
va: 2.1303 2.1196 3.8180 3.8783 3.8636 3.8986 3.8489 3.9384 3.9604 3.9337 3.9404 3.8545 3.9367 3.6522 3.9236 3.7924 4.2183 3.9815 3.7889 3.6884 1.0112 1.0127 1.0100 1.0122 1.0177 1.0138 1.0153 1.0168 1.0095 1.0063 1.0003 1.0057 1.0061 1.0050 1.0032 1.0093 1.0052 1.0076 1.0080 1.0066 1.0293 0.9975 1.0385 0.9983 1.0370 0.9851 1.0014 0.9743
dispcorr: -0.020499471 hartree
energy: -853.249907302976
dipole: -34.09090 33.23623 -0.85467 18.48250 -18.13666 0.34584 -5.07910 5.31835 0.23925
magnitude: 0.95252 au
magnitude: 2.42113 debye
