program: Orca
programVersion: 5.0.2
elementType: O O C C C C C C C C C C C C C C C C C C H H H H H H H H H H H H H H H H H H H H H H H H H H H H
charge: 0
multiplicity: 1
keywords: wb97x-d3
keywords: def2-TZVPP
keywords: def2/J RIJCOSX
keywords: DEFGRID2
keywords: scfconv7
keywords: smallprint printgap noloewdin
keywords: NOSOSCF
formula: C18H28O2
InChI: InChI=1/C18H28O2/c1-6-13-20-18(19)14-17(5)12-8-11-16(4)10-7-9-15(2)3/h1,8,12,14-16H,7,9-11,13H2,2-5H3
48 atoms
O  3.708023 -0.493076 1.305569
O  3.365278 -1.184904 -0.792901
C  -4.374935 -0.423721 0.238189
C  -3.961828 1.04708 0.365072
C  -2.911732 1.535391 -0.62754
C  -2.609432 3.020945 -0.459203
C  -1.412773 3.541196 -1.263469
C  -3.343186 -1.402284 0.826367
C  -5.719919 -0.650447 0.923748
C  -0.091059 2.954832 -0.773793
C  -1.584443 3.32555 -2.763818
C  -2.032149 -1.452538 0.118714
C  -0.844944 -1.261944 0.70004
C  0.445629 -1.281478 0.017449
C  0.453315 -1.603235 -1.44437
C  1.533367 -0.981762 0.755158
C  2.925326 -0.9195 0.294624
C  5.098762 -0.402495 1.043458
C  5.762613 -1.697116 1.117879
C  6.333225 -2.74793 1.203264
H  -4.495857 -0.65698 -0.827473
H  -4.85688 1.667681 0.24615
H  -3.612358 1.230637 1.388164
H  -1.994051 0.960111 -0.50665
H  -3.26517 1.339112 -1.644812
H  -2.427972 3.228258 0.601217
H  -3.499696 3.599996 -0.72782
H  -1.370566 4.622606 -1.091054
H  -3.781304 -2.407063 0.793334
H  -3.189921 -1.17174 1.885486
H  -6.04737 -1.687742 0.838969
H  -5.662152 -0.409112 1.987546
H  -6.496973 -0.021905 0.487627
H  0.047898 3.123087 0.295464
H  0.754684 3.410524 -1.290946
H  -0.028067 1.878323 -0.944804
H  -0.784762 3.812853 -3.32358
H  -1.559544 2.265819 -3.025164
H  -2.531962 3.732298 -3.12205
H  -2.081224 -1.660672 -0.946527
H  -0.819607 -1.042651 1.763665
H  1.450658 -1.625534 -1.864753
H  -0.134197 -0.86283 -1.992173
H  -0.015844 -2.572905 -1.618879
H  1.390302 -0.750762 1.804078
H  5.497174 0.259526 1.813036
H  5.289963 0.05593 0.070405
H  6.827879 -3.686758 1.268133
totalener: -853.22696627 hartree
nucrepener: 1509.97545680 hartree
electener: -2363.20242306 hartree
oneelecener: -4154.09097566 hartree
twoeener: 1790.88855259 hartree
kineticenergy: 849.18819775 hartree
xcener: -85.612140139505 hartree
chargesum: 0.0000000
charge: -0.261696 -0.383404 0.067569 -0.172979 -0.064920 -0.163542 0.053819 -0.126033 -0.271459 -0.260517 -0.284190 -0.122377 -0.083196 0.007601 -0.255861 -0.163738 0.428522 -0.013203 -0.366210 0.070772 0.033717 0.070314 0.061209 0.008964 0.068600 0.067386 0.073766 0.037870 0.089498 0.070371 0.081336 0.082196 0.082602 0.083890 0.087793 0.057665 0.088164 0.072517 0.085471 0.107218 0.072621 0.126545 0.082313 0.097130 0.094018 0.116171 0.125737 0.239961
qa: -0.2617 -0.3834 0.0676 -0.1730 -0.0649 -0.1635 0.0538 -0.1260 -0.2715 -0.2605 -0.2842 -0.1224 -0.0832 0.0076 -0.2559 -0.1637 0.4285 -0.0132 -0.3662 0.0708 0.0337 0.0703 0.0612 0.0090 0.0686 0.0674 0.0738 0.0379 0.0895 0.0704 0.0813 0.0822 0.0826 0.0839 0.0878 0.0577 0.0882 0.0725 0.0855 0.1072 0.0726 0.1265 0.0823 0.0971 0.0940 0.1162 0.1257 0.2400
va: 2.1324 2.1186 3.7877 3.9371 3.8109 3.9293 3.8571 3.9267 3.9436 3.9553 3.9479 3.8931 3.9220 3.6721 3.9149 3.7907 4.2102 3.9839 3.7946 3.6798 1.0218 1.0093 1.0133 1.0483 1.0108 1.0110 1.0107 1.0102 1.0064 1.0177 1.0079 1.0027 1.0078 1.0073 1.0080 1.0022 1.0081 1.0003 1.0048 1.0081 1.0316 1.0394 0.9956 0.9989 1.0369 0.9850 1.0016 0.9744
dispcorr: -0.021124882 hartree
energy: -853.248091147459
dipole: -34.92227 34.06302 -0.85925 15.85018 -15.62393 0.22625 -7.55488 7.88124 0.32637
magnitude: 0.94658 au
magnitude: 2.40602 debye
