program: Orca
programVersion: 5.0.2
elementType: O O C C C C C C C C C C C C C C C C C C H H H H H H H H H H H H H H H H H H H H H H H H H H H H
charge: 0
multiplicity: 1
keywords: wb97x-d3
keywords: def2-TZVPP
keywords: def2/J RIJCOSX
keywords: DEFGRID2
keywords: scfconv7
keywords: smallprint printgap noloewdin
keywords: NOSOSCF
formula: C18H28O2
InChI: InChI=1/C18H28O2/c1-6-13-20-18(19)14-17(5)12-8-11-16(4)10-7-9-15(2)3/h1,8,12,14-16H,7,9-11,13H2,2-5H3
48 atoms
O  3.678771 -0.466827 1.309561
O  3.342239 -1.184695 -0.780878
C  -4.377116 -0.413206 0.231629
C  -3.940981 1.050544 0.36652
C  -2.886177 1.529214 -0.626066
C  -2.547491 3.004297 -0.435489
C  -1.3536 3.51452 -1.250303
C  -3.366493 -1.409122 0.828101
C  -5.73221 -0.619654 0.903618
C  -0.036976 2.888671 -0.797188
C  -1.556667 3.334769 -2.751463
C  -2.051955 -1.480253 0.129031
C  -0.866543 -1.286298 0.712855
C  0.426382 -1.317214 0.035024
C  0.440919 -1.681084 -1.416828
C  1.509359 -0.987007 0.766727
C  2.900398 -0.91474 0.304817
C  5.066036 -0.349407 1.039651
C  5.756443 -1.630254 1.109517
C  6.350364 -2.668446 1.189278
H  -4.491436 -0.64243 -0.835614
H  -4.826278 1.686121 0.254255
H  -3.586246 1.222018 1.389905
H  -1.981751 0.930131 -0.521535
H  -3.25194 1.357909 -1.643441
H  -2.343478 3.186896 0.625385
H  -3.429133 3.607934 -0.677139
H  -1.283971 4.590801 -1.056052
H  -3.820963 -2.406474 0.792847
H  -3.216813 -1.179517 1.887896
H  -6.074465 -1.651876 0.815557
H  -5.681568 -0.378929 1.967913
H  -6.494996 0.020668 0.45951
H  0.809636 3.33684 -1.319501
H  -0.001368 1.815069 -0.992432
H  0.124448 3.030055 0.272813
H  -0.754925 3.813845 -3.315381
H  -1.562859 2.280437 -3.034624
H  -2.499846 3.772031 -3.084245
H  -2.096786 -1.704739 -0.933073
H  -0.84507 -1.049308 1.772739
H  1.441071 -1.728043 -1.82842
H  -0.131426 -0.948652 -1.990859
H  -0.040725 -2.648592 -1.566929
H  1.361801 -0.730974 1.809174
H  5.455386 0.319869 1.807565
H  5.24239 0.113708 0.065928
H  6.867725 -3.595347 1.247658
totalener: -853.22688935 hartree
nucrepener: 1511.87372362 hartree
electener: -2365.10061297 hartree
oneelecener: -4157.89349381 hartree
twoeener: 1792.79288084 hartree
kineticenergy: 849.18783164 hartree
xcener: -85.611986910793 hartree
chargesum: -0.0000000
charge: -0.261798 -0.383430 0.068363 -0.173845 -0.068784 -0.161429 0.054875 -0.126443 -0.271717 -0.262402 -0.285071 -0.119727 -0.087119 0.009857 -0.256335 -0.165926 0.430249 -0.013044 -0.366148 0.070484 0.033805 0.070671 0.061006 0.011350 0.068518 0.067462 0.073627 0.037646 0.089229 0.070566 0.081166 0.082426 0.082640 0.088052 0.058243 0.084009 0.088054 0.072880 0.085771 0.107198 0.072746 0.126745 0.083096 0.096896 0.093859 0.116131 0.125688 0.239909
qa: -0.2618 -0.3834 0.0684 -0.1738 -0.0688 -0.1614 0.0549 -0.1264 -0.2717 -0.2624 -0.2851 -0.1197 -0.0871 0.0099 -0.2563 -0.1659 0.4302 -0.0130 -0.3661 0.0705 0.0338 0.0707 0.0610 0.0114 0.0685 0.0675 0.0736 0.0376 0.0892 0.0706 0.0812 0.0824 0.0826 0.0881 0.0582 0.0840 0.0881 0.0729 0.0858 0.1072 0.0727 0.1267 0.0831 0.0969 0.0939 0.1161 0.1257 0.2399
va: 2.1322 2.1184 3.7844 3.9376 3.8146 3.9259 3.8580 3.9283 3.9437 3.9557 3.9477 3.8885 3.9251 3.6682 3.9149 3.7909 4.2086 3.9850 3.7930 3.6811 1.0218 1.0092 1.0134 1.0462 1.0112 1.0110 1.0107 1.0101 1.0067 1.0176 1.0079 1.0026 1.0078 1.0081 1.0022 1.0072 1.0080 1.0003 1.0047 1.0081 1.0316 1.0393 0.9958 0.9988 1.0369 0.9851 1.0013 0.9745
dispcorr: -0.021177599 hartree
energy: -853.248066950149
dipole: -34.68234 33.82619 -0.85615 15.67311 -15.44357 0.22954 -7.61143 7.93213 0.32070
magnitude: 0.94262 au
magnitude: 2.39595 debye
