program: Orca
programVersion: 5.0.2
elementType: O O C C C C C C C C C C C C C C C C C C H H H H H H H H H H H H H H H H H H H H H H H H H H H H
charge: 0
multiplicity: 1
keywords: wb97x-d3
keywords: def2-TZVPP
keywords: def2/J RIJCOSX
keywords: DEFGRID2
keywords: scfconv7
keywords: smallprint printgap noloewdin
keywords: NOSOSCF
formula: C18H28O2
InChI: InChI=1/C18H28O2/c1-6-13-20-18(19)14-17(5)12-8-11-16(4)10-7-9-15(2)3/h1,8,12,14-16H,7,9-11,13H2,2-5H3
48 atoms
O  3.25856 -1.201943 1.214058
O  2.985788 -1.539788 -0.979552
C  -3.94165 0.233884 0.058438
C  -3.059844 1.050978 1.012113
C  -2.705946 2.451835 0.513817
C  -1.7370 2.486434 -0.669824
C  -0.385541 1.800535 -0.45203
C  -3.692391 -1.280949 0.222629
C  -5.416407 0.568294 0.252665
C  0.459215 1.871248 -1.719946
C  0.382077 2.381334 0.730218
C  -2.380276 -1.650918 -0.380251
C  -1.251416 -1.852277 0.303952
C  0.079105 -1.920901 -0.294194
C  0.172156 -2.10506 -1.776788
C  1.124089 -1.708063 0.529869
C  2.517581 -1.499813 0.127794
C  4.595019 -0.79267 0.973653
C  4.657175 0.571362 0.463666
C  4.705056 1.700646 0.063433
H  -3.677877 0.492501 -0.974097
H  -3.575709 1.130454 1.974921
H  -2.133782 0.511105 1.222132
H  -3.619679 2.985443 0.232872
H  -2.283261 3.023441 1.344133
H  -1.560009 3.533755 -0.939907
H  -2.214936 2.037813 -1.547368
H  -0.566096 0.742203 -0.244287
H  -4.496144 -1.834209 -0.272463
H  -3.728307 -1.547695 1.283074
H  -6.042654 0.069397 -0.488417
H  -5.761359 0.259002 1.241827
H  -5.596169 1.640648 0.163611
H  -0.0697 1.449353 -2.57719
H  1.393762 1.319286 -1.604586
H  0.711835 2.904807 -1.96967
H  -0.150424 2.253381 1.673693
H  1.354143 1.897011 0.83991
H  0.559754 3.451513 0.595418
H  -2.3470 -1.630322 -1.465765
H  -1.29138 -1.842267 1.389603
H  -0.116849 -1.183249 -2.287882
H  -0.515356 -2.885703 -2.103234
H  1.172455 -2.358494 -2.104738
H  0.926792 -1.582403 1.587808
H  5.103835 -1.471547 0.285634
H  5.096361 -0.851054 1.940005
H  4.741988 2.697736 -0.303862
totalener: -853.22473474 hartree
nucrepener: 1599.61149674 hartree
electener: -2452.83623149 hartree
oneelecener: -4333.42389541 hartree
twoeener: 1880.58766393 hartree
kineticenergy: 849.19235240 hartree
xcener: -85.615742286491 hartree
chargesum: 0.0000000
charge: -0.261430 -0.381021 0.040940 -0.158340 -0.178283 -0.159445 0.140828 -0.130325 -0.275256 -0.288327 -0.267804 -0.079370 -0.129507 0.044686 -0.260894 -0.174335 0.414202 0.003315 -0.349473 0.040311 0.045418 0.084039 0.074968 0.075150 0.083667 0.075407 0.067455 -0.076300 0.082149 0.077921 0.082537 0.078001 0.085897 0.076943 0.096563 0.084101 0.077979 0.080239 0.083969 0.094863 0.086757 0.092729 0.100911 0.120032 0.095592 0.127028 0.117266 0.238248
qa: -0.2614 -0.3810 0.0409 -0.1583 -0.1783 -0.1594 0.1408 -0.1303 -0.2753 -0.2883 -0.2678 -0.0794 -0.1295 0.0447 -0.2609 -0.1743 0.4142 0.0033 -0.3495 0.0403 0.0454 0.0840 0.0750 0.0751 0.0837 0.0754 0.0675 -0.0763 0.0821 0.0779 0.0825 0.0780 0.0859 0.0769 0.0966 0.0841 0.0780 0.0802 0.0840 0.0949 0.0868 0.0927 0.1009 0.1200 0.0956 0.1270 0.1173 0.2382
va: 2.1220 2.1087 3.7668 3.8493 3.9501 3.8752 3.7768 3.9387 3.9456 3.9343 3.9411 3.8347 3.9193 3.6559 3.9276 3.7877 4.1931 3.9691 3.7677 3.7263 1.0227 1.0096 1.0100 1.0127 1.0032 1.0155 1.0112 1.0628 1.0112 1.0153 1.0072 1.0047 1.0074 1.0060 1.0092 1.0100 1.0057 1.0151 1.0058 1.0122 1.0244 0.9950 0.9988 1.0336 1.0370 1.0016 0.9851 0.9766
dispcorr: -0.025598268 hartree
energy: -853.250333010469
dipole: -26.85568 26.12553 -0.73015 14.31036 -14.20918 0.10118 -2.92536 3.26607 0.34070
magnitude: 0.81206 au
magnitude: 2.06409 debye
