program: Orca
programVersion: 5.0.2
elementType: O O C C C C C C C C C C C C C C C C C C H H H H H H H H H H H H H H H H H H H H H H H H H H H H
charge: 0
multiplicity: 1
keywords: wb97x-d3
keywords: def2-TZVPP
keywords: def2/J RIJCOSX
keywords: DEFGRID2
keywords: scfconv7
keywords: smallprint printgap noloewdin
keywords: NOSOSCF
formula: C18H28O2
InChI: InChI=1/C18H28O2/c1-6-13-20-18(19)14-17(5)12-8-11-16(4)10-7-9-15(2)3/h1,8,12,14-16H,7,9-11,13H2,2-5H3
48 atoms
O  3.524121 -1.546122 1.343777
O  3.235374 -1.649078 -0.870389
C  -4.001667 0.139915 0.134098
C  -3.215364 1.117982 1.014322
C  -3.153444 2.55162 0.490039
C  -2.394494 2.723221 -0.82753
C  -0.97407 2.152376 -0.860787
C  -3.528935 -1.309761 0.363912
C  -5.502801 0.266107 0.36781
C  -0.345884 2.372064 -2.233199
C  -0.086372 2.736529 0.231885
C  -2.193373 -1.536764 -0.25801
C  -1.039969 -1.642422 0.406889
C  0.283381 -1.704369 -0.208765
C  0.351467 -1.772688 -1.702392
C  1.345815 -1.652819 0.619061
C  2.761689 -1.621761 0.234702
C  4.924006 -1.435122 1.145403
C  5.323454 -0.094123 0.7389
C  5.675584 1.008736 0.427641
H  -3.808956 0.377878 -0.918746
H  -3.663982 1.12102 2.013703
H  -2.194993 0.751869 1.154397
H  -4.166142 2.946568 0.362598
H  -2.69445 3.18046 1.257533
H  -2.350444 3.792309 -1.063682
H  -2.968328 2.270959 -1.643206
H  -1.034896 1.070887 -0.697595
H  -4.25611 -1.998065 -0.078487
H  -3.502764 -1.52438 1.436526
H  -6.069637 -0.365094 -0.31826
H  -5.766962 -0.029607 1.38561
H  -5.845102 1.291963 0.225195
H  -0.954502 1.935749 -3.027737
H  0.646385 1.92174 -2.291523
H  -0.236944 3.437022 -2.451487
H  -0.466228 2.522836 1.231748
H  0.922444 2.325069 0.17705
H  -0.007452 3.822268 0.134406
H  -2.183466 -1.534706 -1.344169
H  -1.06359 -1.630681 1.493081
H  -0.050106 -0.854262 -2.137195
H  -0.264163 -2.595137 -2.069622
H  1.360809 -1.903907 -2.070881
H  1.160897 -1.600139 1.685399
H  5.280449 -2.164869 0.414471
H  5.372982 -1.675949 2.109476
H  5.981829 1.984518 0.136976
totalener: -853.22725249 hartree
nucrepener: 1553.28201905 hartree
electener: -2406.50927155 hartree
oneelecener: -4240.69028969 hartree
twoeener: 1834.18101814 hartree
kineticenergy: 849.18598141 hartree
xcener: -85.614447798603 hartree
chargesum: -0.0000000
charge: -0.261868 -0.381689 0.037317 -0.151278 -0.176118 -0.172977 0.159771 -0.134914 -0.273215 -0.295709 -0.279649 -0.082183 -0.132773 0.045016 -0.261653 -0.172227 0.426516 -0.010435 -0.364775 0.066258 0.045166 0.081925 0.072068 0.074060 0.082593 0.076901 0.072311 -0.082692 0.085260 0.077396 0.082514 0.077611 0.086977 0.082795 0.094710 0.084953 0.078479 0.091819 0.084762 0.098216 0.082909 0.085844 0.096326 0.126224 0.095155 0.125484 0.116789 0.240024
qa: -0.2619 -0.3817 0.0373 -0.1513 -0.1761 -0.1730 0.1598 -0.1349 -0.2732 -0.2957 -0.2796 -0.0822 -0.1328 0.0450 -0.2617 -0.1722 0.4265 -0.0104 -0.3648 0.0663 0.0452 0.0819 0.0721 0.0741 0.0826 0.0769 0.0723 -0.0827 0.0853 0.0774 0.0825 0.0776 0.0870 0.0828 0.0947 0.0850 0.0785 0.0918 0.0848 0.0982 0.0829 0.0858 0.0963 0.1262 0.0952 0.1255 0.1168 0.2400
va: 2.1316 2.1196 3.7561 3.8518 3.9423 3.8867 3.7672 3.9438 3.9493 3.9351 3.9405 3.8369 3.9131 3.6422 3.9225 3.7979 4.2108 3.9820 3.7878 3.6931 1.0214 1.0119 1.0112 1.0124 1.0027 1.0148 1.0066 1.0632 1.0097 1.0160 1.0073 1.0047 1.0070 1.0038 1.0042 1.0104 1.0042 1.0096 1.0059 1.0105 1.0272 0.9916 0.9983 1.0381 1.0366 1.0008 0.9853 0.9746
dispcorr: -0.023139618 hartree
energy: -853.250392112047
dipole: -31.24067 30.46198 -0.77869 16.40400 -16.35501 0.04899 -4.93197 5.28691 0.35494
magnitude: 0.85717 au
magnitude: 2.17875 debye
