program: Orca
programVersion: 5.0.2
elementType: O O C C C C C C C C C C C C C C C C C C H H H H H H H H H H H H H H H H H H H H H H H H H H H H
charge: 0
multiplicity: 1
keywords: wb97x-d3
keywords: def2-TZVPP
keywords: def2/J RIJCOSX
keywords: DEFGRID2
keywords: scfconv7
keywords: smallprint printgap noloewdin
keywords: NOSOSCF
formula: C18H28O2
InChI: InChI=1/C18H28O2/c1-6-13-20-18(19)14-17(5)12-8-11-16(4)10-7-9-15(2)3/h1,8,12,14-16H,7,9-11,13H2,2-5H3
48 atoms
O  3.146744 -1.203838 1.265572
O  2.83529 -1.456253 -0.935161
C  -4.335275 0.045525 0.15601
C  -3.289855 1.054375 0.654607
C  -2.284233 1.515739 -0.401475
C  -1.019582 2.098517 0.217162
C  -0.042458 2.741006 -0.769155
C  -3.85986 -1.409572 0.35569
C  -5.673224 0.233253 0.863472
C  1.154415 3.32168 -0.022095
C  0.431173 1.768271 -1.844355
C  -2.543712 -1.692778 -0.281873
C  -1.391857 -1.770869 0.389748
C  -0.067111 -1.836496 -0.217932
C  0.014558 -2.101877 -1.688621
C  0.983676 -1.585634 0.588802
C  2.381662 -1.427949 0.178793
C  4.506922 -0.877752 1.028955
C  4.664838 0.50887 0.608972
C  4.79702 1.656177 0.286842
H  -4.494026 0.210198 -0.916632
H  -3.795962 1.93693 1.057422
H  -2.752992 0.618481 1.505125
H  -2.016652 0.680732 -1.05128
H  -2.761811 2.257914 -1.050969
H  -0.500913 1.302733 0.765564
H  -1.300647 2.846609 0.967186
H  -0.565584 3.567397 -1.266304
H  -4.620711 -2.085728 -0.04668
H  -3.799744 -1.607208 1.430575
H  -5.565015 0.11288 1.943707
H  -6.07727 1.230036 0.683241
H  -6.415926 -0.490886 0.524588
H  1.726382 2.532828 0.472246
H  0.843849 4.036219 0.742379
H  1.832769 3.839855 -0.7022
H  1.137896 2.248638 -2.522717
H  0.941791 0.909175 -1.403218
H  -0.392707 1.392966 -2.452903
H  -2.539619 -1.757456 -1.366076
H  -1.418413 -1.682172 1.472289
H  -0.641194 -2.930436 -1.957237
H  1.020491 -2.328934 -2.018791
H  -0.323857 -1.226299 -2.247613
H  0.793084 -1.421678 1.642845
H  4.95514 -1.545004 0.289346
H  5.015195 -1.036439 1.980459
H  4.906711 2.671353 -0.009544
totalener: -853.22569449 hartree
nucrepener: 1585.66229823 hartree
electener: -2438.88799271 hartree
oneelecener: -4305.59207589 hartree
twoeener: 1866.70408318 hartree
kineticenergy: 849.19117275 hartree
xcener: -85.612466643262 hartree
chargesum: -0.0000000
charge: -0.261470 -0.382155 0.059677 -0.184461 -0.096771 -0.181939 0.087669 -0.147475 -0.283094 -0.267637 -0.278434 -0.075881 -0.138184 0.036437 -0.260385 -0.183482 0.420471 -0.002883 -0.344807 0.041416 0.046213 0.080425 0.066253 0.050150 0.081684 0.057456 0.077525 0.023845 0.083232 0.075979 0.083655 0.084320 0.081049 0.072673 0.079876 0.078203 0.090320 0.066249 0.078564 0.107864 0.081196 0.101741 0.121883 0.091822 0.097632 0.126833 0.117154 0.239592
qa: -0.2615 -0.3822 0.0597 -0.1845 -0.0968 -0.1819 0.0877 -0.1475 -0.2831 -0.2676 -0.2784 -0.0759 -0.1382 0.0364 -0.2604 -0.1835 0.4205 -0.0029 -0.3448 0.0414 0.0462 0.0804 0.0663 0.0502 0.0817 0.0575 0.0775 0.0238 0.0832 0.0760 0.0837 0.0843 0.0810 0.0727 0.0799 0.0782 0.0903 0.0662 0.0786 0.1079 0.0812 0.1017 0.1219 0.0918 0.0976 0.1268 0.1172 0.2396
va: 2.1302 2.1058 3.7639 3.9006 3.8152 3.9111 3.8266 3.9526 3.9581 3.9544 3.9377 3.8183 3.9292 3.6209 3.9145 3.7715 4.1911 3.9726 3.7797 3.7230 1.0191 1.0082 1.0136 1.0187 1.0129 1.0111 1.0137 1.0161 1.0128 1.0129 1.0018 1.0061 1.0075 1.0053 1.0102 1.0060 1.0161 1.0174 0.9998 1.0045 1.0279 0.9993 1.0340 0.9989 1.0369 1.0023 0.9852 0.9755
dispcorr: -0.024705182 hartree
energy: -853.250399667525
dipole: -25.22992 24.44284 -0.78708 13.47941 -13.41145 0.06796 -3.59398 3.89962 0.30564
magnitude: 0.84707 au
magnitude: 2.15309 debye
