program: Orca
programVersion: 5.0.2
elementType: O O C C C C C C C C C C C C C C C C C H H H H H H H H H H H H H H H H H H H H H H H H H H H H H H
charge: 0
multiplicity: 1
keywords: wb97x-d3
keywords: def2-TZVPP
keywords: def2/J RIJCOSX
keywords: DEFGRID2
keywords: scfconv7
keywords: smallprint printgap noloewdin
keywords: NOSOSCF
formula: C17H30O2
InChI: InChI=1/C17H30O2/c1-6-19-17(18)13-16(5)12-8-11-15(4)10-7-9-14(2)3/h8,12-15H,6-7,9-11H2,1-5H3
49 atoms
O  4.1407 -1.754543 1.154792
O  3.735929 -1.640653 -1.036143
C  -3.791934 -0.243818 0.158258
C  -3.065997 1.058868 0.488598
C  -3.659435 2.299231 -0.17381
C  -2.74027 3.524357 -0.105909
C  -1.845012 3.732144 -1.331255
C  -2.96881 -1.460752 0.610833
C  -5.188356 -0.290948 0.764559
C  -1.005977 4.993437 -1.16057
C  -0.948319 2.538504 -1.644146
C  -1.66346 -1.541375 -0.103028
C  -0.46455 -1.55536 0.489163
C  0.816324 -1.582603 -0.212383
C  0.78111 -1.513509 -1.705523
C  1.928224 -1.648188 0.553197
C  3.320831 -1.677429 0.104902
C  5.553416 -1.795006 0.902482
C  6.257811 -1.901711 2.230889
H  -3.890484 -0.305446 -0.933251
H  -2.019081 0.964939 0.193088
H  -3.053231 1.19847 1.576223
H  -4.617878 2.535362 0.294655
H  -3.890627 2.077279 -1.222121
H  -3.344458 4.42768 0.01688
H  -2.11317 3.463549 0.791845
H  -2.506075 3.881508 -2.193617
H  -3.545694 -2.367409 0.396933
H  -2.814073 -1.429419 1.693598
H  -5.142506 -0.232408 1.854702
H  -5.809413 0.535297 0.416349
H  -5.70413 -1.217153 0.504409
H  -0.313344 4.894537 -0.320893
H  -1.630621 5.868226 -0.969376
H  -0.412209 5.20208 -2.052544
H  -0.321142 2.746576 -2.513452
H  -0.283389 2.308979 -0.807576
H  -1.520819 1.637583 -1.871359
H  -1.729633 -1.563509 -1.18747
H  -0.416948 -1.534901 1.574306
H  0.266498 -0.603555 -2.021642
H  0.209958 -2.351192 -2.109232
H  1.762586 -1.523831 -2.16098
H  1.795906 -1.686216 1.62832
H  5.859659 -0.88992 0.373736
H  5.79168 -2.651975 0.269038
H  5.980794 -2.812036 2.762759
H  7.333662 -1.931752 2.060252
H  6.046756 -1.045116 2.871016
elementType: O C H
totalener: -816.41297084 hartree
nucrepener: 1423.55458499 hartree
electener: -2239.96755583 hartree
oneelecener: -3932.47742980 hartree
twoeener: 1692.50987397 hartree
cpcmener: -0.02065316 hartree
kineticenergy: 812.45862656 hartree
xcener: -82.315140069423 hartree
chargesum: -0.0000000
charge: -0.292902 -0.515898 0.076872 -0.192914 -0.128928 -0.188911 0.098476 -0.112328 -0.315513 -0.303527 -0.319337 -0.136795 -0.150940 0.016673 -0.254041 -0.175507 0.484301 0.038940 -0.254095 0.042047 0.074157 0.078490 0.084531 0.067294 0.083309 0.066748 0.026515 0.095661 0.080569 0.083335 0.093725 0.092580 0.081326 0.088187 0.089708 0.100564 0.085020 0.081545 0.125941 0.116039 0.099637 0.108716 0.107774 0.115838 0.096891 0.094878 0.088107 0.089125 0.088118
qa: -0.2929 -0.5159 0.0769 -0.1929 -0.1289 -0.1889 0.0985 -0.1123 -0.3155 -0.3035 -0.3193 -0.1368 -0.1509 0.0167 -0.2540 -0.1755 0.4843 0.0389 -0.2541 0.0420 0.0742 0.0785 0.0845 0.0673 0.0833 0.0667 0.0265 0.0957 0.0806 0.0833 0.0937 0.0926 0.0813 0.0882 0.0897 0.1006 0.0850 0.0815 0.1259 0.1160 0.0996 0.1087 0.1078 0.1158 0.0969 0.0949 0.0881 0.0891 0.0881
va: 2.1162 1.9837 3.7729 3.8953 3.8510 3.8999 3.8094 3.9155 3.9490 3.9344 3.9359 3.8737 3.8783 3.6946 3.9180 3.7824 4.1365 3.8451 3.9707 1.0246 0.9953 1.0177 1.0059 1.0082 1.0063 1.0088 1.0182 1.0058 1.0160 1.0017 1.0015 1.0044 1.0030 1.0051 1.0049 1.0063 0.9990 1.0008 1.0038 1.0223 0.9962 0.9965 1.0367 1.0323 0.9955 0.9964 1.0032 1.0063 1.0032
dispcorr: -0.020462208 hartree
energy: -816.433433048720
dipole: -18.83707 17.75907 -1.07800 16.59778 -16.52614 0.07164 -0.93171 1.58527 0.65356
magnitude: 1.26268 au
magnitude: 3.20949 debye
