program: Orca
programVersion: 5.0.2
elementType: O O C C C C C C C C C C C C C C C C C H H H H H H H H H H H H H H H H H H H H H H H H H H H H H H
charge: 0
multiplicity: 1
keywords: wb97x-d3
keywords: def2-TZVPP
keywords: def2/J RIJCOSX
keywords: DEFGRID2
keywords: scfconv7
keywords: smallprint printgap noloewdin
keywords: NOSOSCF
formula: C17H30O2
InChI: InChI=1/C17H30O2/c1-6-19-17(18)13-16(5)12-8-11-15(4)10-7-9-14(2)3/h8,12-15H,6-7,9-11H2,1-5H3
49 atoms
O  3.981097 -1.227505 1.399806
O  3.745708 -0.968873 -0.80971
C  -3.801163 -0.087786 0.141135
C  -3.182032 1.008711 1.013682
C  -3.447385 2.435429 0.536892
C  -2.854154 2.774652 -0.831966
C  -1.358213 2.496862 -0.994494
C  -3.053796 -1.422346 0.313106
C  -5.28376 -0.26161 0.4457
C  -0.907128 2.827841 -2.412205
C  -0.517748 3.257118 0.024015
C  -1.702089 -1.3663 -0.309749
C  -0.546787 -1.39039 0.363634
C  0.777735 -1.245368 -0.234501
C  0.849517 -1.06946 -1.717529
C  1.828997 -1.265728 0.614662
C  3.249343 -1.137776 0.285792
C  5.411302 -1.183313 1.293315
C  5.993812 -2.523201 0.904933
H  -3.705953 0.198368 -0.912525
H  -2.10158 0.858674 1.088785
H  -3.562682 0.895115 2.034554
H  -3.0543 3.128484 1.285831
H  -4.525065 2.623011 0.50385
H  -3.395025 2.228347 -1.611158
H  -3.037643 3.835635 -1.036514
H  -1.187971 1.425314 -0.840015
H  -3.63509 -2.213872 -0.171093
H  -2.984211 -1.677107 1.374804
H  -5.433113 -0.626335 1.464824
H  -5.825184 0.681413 0.352352
H  -5.750966 -0.975746 -0.234685
H  -1.47079 2.259341 -3.154629
H  0.150566 2.59872 -2.556825
H  -1.046741 3.888868 -2.634582
H  -0.757968 2.977238 1.05091
H  0.54669 3.063374 -0.121963
H  -0.671576 4.335585 -0.06778
H  -1.69498 -1.247551 -1.389507
H  -0.575087 -1.503379 1.443842
H  0.312384 -0.16436 -2.011136
H  0.356162 -1.901699 -2.221915
H  1.861927 -0.99683 -2.093145
H  1.61828 -1.398289 1.66956
H  5.750573 -0.895552 2.287015
H  5.717819 -0.399277 0.599595
H  5.692025 -2.832397 -0.095057
H  7.081959 -2.454458 0.915896
H  5.703438 -3.301139 1.611108
elementType: O C H
totalener: -816.41321755 hartree
nucrepener: 1472.40957437 hartree
electener: -2288.82279192 hartree
oneelecener: -4030.13296865 hartree
twoeener: 1741.31017674 hartree
cpcmener: -0.02007047 hartree
kineticenergy: 812.45407132 hartree
xcener: -82.318785807991 hartree
chargesum: -0.0000000
charge: -0.299116 -0.515873 0.049274 -0.165477 -0.178031 -0.184706 0.161767 -0.122166 -0.306367 -0.319528 -0.310815 -0.097832 -0.180395 0.016593 -0.260440 -0.178281 0.490935 0.040435 -0.253928 0.053851 0.079999 0.083824 0.081740 0.078716 0.078914 0.080282 -0.059772 0.092277 0.082092 0.082118 0.093009 0.091565 0.093303 0.091122 0.091590 0.088432 0.092812 0.090642 0.125136 0.119230 0.103617 0.109820 0.109637 0.115530 0.108256 0.086672 0.086213 0.095331 0.087991
qa: -0.2991 -0.5159 0.0493 -0.1655 -0.1780 -0.1847 0.1618 -0.1222 -0.3064 -0.3195 -0.3108 -0.0978 -0.1804 0.0166 -0.2604 -0.1783 0.4909 0.0404 -0.2539 0.0539 0.0800 0.0838 0.0817 0.0787 0.0789 0.0803 -0.0598 0.0923 0.0821 0.0821 0.0930 0.0916 0.0933 0.0911 0.0916 0.0884 0.0928 0.0906 0.1251 0.1192 0.1036 0.1098 0.1096 0.1155 0.1083 0.0867 0.0862 0.0953 0.0880
va: 2.1144 1.9785 3.7433 3.8641 3.9285 3.8950 3.7418 3.9267 3.9458 3.9266 3.9331 3.8347 3.8728 3.6838 3.9212 3.7745 4.1446 3.8473 3.9173 1.0212 1.0000 1.0111 1.0012 1.0091 1.0028 1.0114 1.0588 1.0056 1.0143 1.0021 1.0030 1.0044 1.0023 1.0030 1.0064 1.0009 1.0053 1.0030 1.0023 1.0206 0.9867 0.9968 1.0359 1.0338 0.9958 1.0127 1.0143 1.0072 1.0041
dispcorr: -0.022768058 hartree
energy: -816.435985605110
dipole: -18.42598 17.36327 -1.06271 11.65664 -11.83631 -0.17967 -3.15907 3.75519 0.59612
magnitude: 1.23166 au
magnitude: 3.13063 debye
