program: Orca
programVersion: 5.0.2
elementType: O O C C C C C C C C C C C C C C C C C H H H H H H H H H H H H H H H H H H H H H H H H H H H H H H
charge: 0
multiplicity: 1
keywords: wb97x-d3
keywords: def2-TZVPP
keywords: def2/J RIJCOSX
keywords: DEFGRID2
keywords: scfconv7
keywords: smallprint printgap noloewdin
keywords: NOSOSCF
formula: C17H30O2
InChI: InChI=1/C17H30O2/c1-6-19-17(18)13-16(5)12-8-11-15(4)10-7-9-14(2)3/h8,12-15H,6-7,9-11H2,1-5H3
49 atoms
O  5.256476 -2.4796 1.25305
O  3.873761 -4.085358 0.539161
C  -1.825997 1.121863 -0.359748
C  -2.545186 2.410728 -0.760044
C  -3.957977 2.546708 -0.203081
C  -4.665976 3.795313 -0.715255
C  -6.051806 4.039125 -0.115681
C  -0.490311 1.009069 -1.112732
C  -1.610171 1.03194 1.145952
C  -6.587182 5.39751 -0.554077
C  -7.040502 2.937685 -0.482104
C  0.168217 -0.31277 -0.917207
C  1.381723 -0.490464 -0.383192
C  2.026202 -1.784314 -0.170141
C  1.265332 -3.006379 -0.574096
C  3.25866 -1.764136 0.384682
C  4.114151 -2.90697 0.708198
C  6.252602 -3.447935 1.612628
C  7.0827 -3.880347 0.425267
H  -2.453462 0.276608 -0.669065
H  -2.594451 2.459271 -1.853363
H  -1.942745 3.27092 -0.445042
H  -3.932389 2.579844 0.890396
H  -4.530214 1.652129 -0.468021
H  -4.035432 4.666002 -0.5033
H  -4.753466 3.745386 -1.807386
H  -5.947584 4.053619 0.976011
H  0.178091 1.819297 -0.806079
H  -0.68625 1.144812 -2.182275
H  -2.553733 1.041972 1.691987
H  -1.088977 0.115108 1.425664
H  -1.011369 1.873466 1.504374
H  -6.705742 5.440442 -1.639727
H  -5.913038 6.205937 -0.264603
H  -7.561837 5.606769 -0.109197
H  -8.027681 3.14034 -0.062255
H  -7.154266 2.861638 -1.566731
H  -6.728935 1.959567 -0.11378
H  -0.415754 -1.173705 -1.230749
H  1.948456 0.382962 -0.072787
H  1.017901 -2.960693 -1.635975
H  0.317349 -3.051145 -0.035145
H  1.802053 -3.928062 -0.391177
H  3.68273 -0.796589 0.627212
H  5.791023 -4.303271 2.107947
H  6.875923 -2.939079 2.346171
H  7.865678 -4.557765 0.767387
H  6.492756 -4.408077 -0.323152
H  7.566356 -3.027869 -0.051699
elementType: O C H
totalener: -816.41605085 hartree
nucrepener: 1340.75032853 hartree
electener: -2157.16637938 hartree
oneelecener: -3766.83499906 hartree
twoeener: 1609.66861968 hartree
cpcmener: -0.02016107 hartree
kineticenergy: 812.45116363 hartree
xcener: -82.313504282014 hartree
chargesum: 0.0000000
charge: -0.299484 -0.516297 0.109613 -0.181968 -0.119793 -0.160588 0.074270 -0.105605 -0.340428 -0.299368 -0.304753 -0.153633 -0.148518 0.015068 -0.263556 -0.182423 0.493312 0.039889 -0.255127 0.043077 0.071206 0.070721 0.065124 0.066568 0.068282 0.066199 0.025603 0.079740 0.094031 0.098222 0.096965 0.085169 0.080590 0.088295 0.090249 0.091366 0.082042 0.089865 0.126390 0.116162 0.106711 0.107132 0.106700 0.116674 0.086570 0.109164 0.095254 0.087093 0.088228
qa: -0.2995 -0.5163 0.1096 -0.1820 -0.1198 -0.1606 0.0743 -0.1056 -0.3404 -0.2994 -0.3048 -0.1536 -0.1485 0.0151 -0.2636 -0.1824 0.4933 0.0399 -0.2551 0.0431 0.0712 0.0707 0.0651 0.0666 0.0683 0.0662 0.0256 0.0797 0.0940 0.0982 0.0970 0.0852 0.0806 0.0883 0.0902 0.0914 0.0820 0.0899 0.1264 0.1162 0.1067 0.1071 0.1067 0.1167 0.0866 0.1092 0.0953 0.0871 0.0882
va: 2.1139 1.9778 3.7468 3.9145 3.8693 3.8908 3.8162 3.9196 3.9512 3.9304 3.9273 3.8876 3.9173 3.7020 3.9216 3.7714 4.1408 3.8464 3.9168 1.0229 1.0122 1.0103 1.0098 1.0087 1.0114 1.0121 1.0188 1.0165 1.0061 1.0019 1.0022 1.0026 1.0031 1.0046 1.0048 1.0041 1.0026 1.0026 1.0040 1.0229 0.9959 0.9958 1.0358 1.0330 1.0127 0.9956 1.0071 1.0141 1.0041
dispcorr: -0.018463712 hartree
energy: -816.434514557749
dipole: -32.28315 31.81861 -0.46453 21.75527 -20.63879 1.11648 -3.61416 3.48150 -0.13266
magnitude: 1.21652 au
magnitude: 3.09214 debye
