program: Orca
programVersion: 5.0.2
elementType: O O C C C C C C C C C C C C C C C C C H H H H H H H H H H H H H H H H H H H H H H H H H H H H H H
charge: 0
multiplicity: 1
keywords: wb97x-d3
keywords: def2-TZVPP
keywords: def2/J RIJCOSX
keywords: DEFGRID2
keywords: scfconv7
keywords: smallprint printgap noloewdin
keywords: NOSOSCF
formula: C17H30O2
InChI: InChI=1/C17H30O2/c1-6-19-17(18)13-16(5)12-8-11-15(4)10-7-9-14(2)3/h8,12-15H,6-7,9-11H2,1-5H3
49 atoms
O  4.04668 -2.878817 -0.36989
O  4.011443 -1.33351 1.24782
C  -3.27039 -0.367628 -0.693986
C  -3.242238 1.067034 -0.165408
C  -3.436206 2.130653 -1.239224
C  -3.405968 3.56089 -0.706088
C  -2.13831 3.973741 0.046462
C  -2.841592 -1.380965 0.383926
C  -4.640473 -0.755406 -1.235663
C  -0.878412 3.753354 -0.782037
C  -2.243336 5.431423 0.479779
C  -1.470217 -1.116176 0.912296
C  -0.372366 -1.712419 0.43521
C  0.994896 -1.436379 0.866889
C  1.185455 -0.41749 1.94431
C  1.973719 -2.124112 0.238692
C  3.418477 -2.037683 0.45569
C  5.479525 -2.943952 -0.337948
C  6.122949 -1.833865 -1.137308
H  -2.54166 -0.441716 -1.510525
H  -2.282981 1.243695 0.32912
H  -4.007868 1.179113 0.612268
H  -4.393228 1.981496 -1.746091
H  -2.669601 2.002938 -2.010439
H  -3.54817 4.24996 -1.546398
H  -4.267382 3.710593 -0.046097
H  -2.057291 3.364003 0.953055
H  -2.882822 -2.384695 -0.046811
H  -3.565958 -1.352785 1.204099
H  -5.404185 -0.674632 -0.458032
H  -4.948616 -0.122621 -2.068182
H  -4.644849 -1.786051 -1.595338
H  -0.92919 4.2999 -1.727519
H  -0.717026 2.700467 -1.019213
H  0.007603 4.102484 -0.24819
H  -1.376008 5.738156 1.067333
H  -2.304831 6.094526 -0.386942
H  -3.132327 5.605267 1.089445
H  -1.382414 -0.37423 1.698986
H  -0.484561 -2.458246 -0.347318
H  2.223843 -0.253101 2.201851
H  0.654524 -0.72358 2.847423
H  0.754276 0.537418 1.638208
H  1.674232 -2.830538 -0.526819
H  5.717477 -3.912037 -0.775659
H  5.837333 -2.950527 0.692653
H  7.201803 -1.990897 -1.155619
H  5.770944 -1.833186 -2.169039
H  5.938721 -0.850411 -0.706853
elementType: O C H
totalener: -816.41315343 hartree
nucrepener: 1411.08317816 hartree
electener: -2227.49633158 hartree
oneelecener: -3907.46424122 hartree
twoeener: 1679.96790963 hartree
cpcmener: -0.02022182 hartree
kineticenergy: 812.45955757 hartree
xcener: -82.316635745110 hartree
chargesum: -0.0000000
charge: -0.298448 -0.515543 0.085958 -0.178199 -0.130380 -0.200437 0.079999 -0.129309 -0.320943 -0.310833 -0.301817 -0.134158 -0.147130 0.007739 -0.259432 -0.176782 0.487999 0.038878 -0.255191 0.044164 0.073804 0.076166 0.084296 0.071461 0.076492 0.075763 0.032786 0.087755 0.093655 0.085327 0.093627 0.091418 0.088077 0.084519 0.092555 0.090020 0.081471 0.088603 0.130748 0.114907 0.106691 0.108055 0.103491 0.115398 0.108857 0.086862 0.095885 0.087678 0.087500
qa: -0.2984 -0.5155 0.0860 -0.1782 -0.1304 -0.2004 0.0800 -0.1293 -0.3209 -0.3108 -0.3018 -0.1342 -0.1471 0.0077 -0.2594 -0.1768 0.4880 0.0389 -0.2552 0.0442 0.0738 0.0762 0.0843 0.0715 0.0765 0.0758 0.0328 0.0878 0.0937 0.0853 0.0936 0.0914 0.0881 0.0845 0.0926 0.0900 0.0815 0.0886 0.1307 0.1149 0.1067 0.1081 0.1035 0.1154 0.1089 0.0869 0.0959 0.0877 0.0875
va: 2.1135 1.9797 3.7987 3.8838 3.8712 3.9153 3.7722 3.9111 3.9490 3.9337 3.9308 3.8755 3.8884 3.7032 3.9211 3.7687 4.1465 3.8484 3.9154 1.0225 1.0046 1.0115 1.0126 1.0024 1.0098 1.0084 1.0151 1.0133 1.0078 1.0014 1.0022 1.0044 1.0030 1.0017 1.0049 1.0045 1.0039 1.0039 0.9921 1.0229 1.0357 0.9961 0.9961 1.0339 0.9957 1.0120 1.0070 1.0044 1.0142
dispcorr: -0.019800188 hartree
energy: -816.432953615753
dipole: -20.47736 19.41041 -1.06695 20.43660 -20.69190 -0.25530 -5.58071 5.02760 -0.55311
magnitude: 1.22861 au
magnitude: 3.12289 debye
