program: Orca
programVersion: 5.0.2
elementType: O O C C C C C C C C C C C C C C C C C H H H H H H H H H H H H H H H H H H H H H H H H H H H H H H
charge: 0
multiplicity: 1
keywords: wb97x-d3
keywords: def2-TZVPP
keywords: def2/J RIJCOSX
keywords: DEFGRID2
keywords: scfconv7
keywords: smallprint printgap noloewdin
keywords: NOSOSCF
formula: C17H30O2
InChI: InChI=1/C17H30O2/c1-6-19-17(18)13-16(5)12-8-11-15(4)10-7-9-14(2)3/h8,12-15H,6-7,9-11H2,1-5H3
49 atoms
O  4.034597 -2.841418 -0.401894
O  3.986817 -1.35396 1.268868
C  -3.275223 -0.372347 -0.700446
C  -3.23418 1.059274 -0.164533
C  -3.410902 2.12953 -1.234681
C  -3.362736 3.557403 -0.696438
C  -2.093776 3.949194 0.065118
C  -2.861402 -1.394812 0.374673
C  -4.64664 -0.742835 -1.250921
C  -0.831412 3.708621 -0.75394
C  -2.178296 5.408329 0.498091
C  -1.493215 -1.142411 0.917607
C  -0.392207 -1.72305 0.42888
C  0.972735 -1.45376 0.871775
C  1.156066 -0.464239 1.977432
C  1.955853 -2.122071 0.229455
C  3.39964 -2.034187 0.451907
C  5.468044 -2.893104 -0.374459
C  6.097771 -1.748751 -1.13561
H  -2.542992 -0.45004 -1.513527
H  -2.275218 1.222758 0.335106
H  -4.001909 1.176315 0.610367
H  -4.368371 1.994912 -1.744732
H  -2.643921 1.994358 -2.004338
H  -3.489998 4.251075 -1.535379
H  -4.225624 3.717901 -0.04097
H  -2.029293 3.33808 0.972162
H  -2.904846 -2.395182 -0.063543
H  -3.592617 -1.368474 1.188602
H  -5.413345 -0.657841 -0.476695
H  -4.944118 -0.103035 -2.081948
H  -4.659954 -1.771703 -1.615452
H  -0.865704 4.256124 -1.699598
H  -0.685434 2.653235 -0.990035
H  0.056132 4.042979 -0.213171
H  -1.310814 5.700649 1.09273
H  -2.222136 6.07285 -0.368634
H  -3.069167 5.596387 1.100782
H  -1.410018 -0.418327 1.721313
H  -0.499654 -2.447668 -0.374003
H  2.192878 -0.304821 2.244467
H  0.621428 -0.795466 2.869451
H  0.724432 0.49778 1.695045
H  1.661344 -2.807822 -0.556564
H  5.715179 -3.842689 -0.846205
H  5.828178 -2.932129 0.654539
H  5.902739 -0.782988 -0.671133
H  7.178392 -1.892609 -1.159878
H  5.745043 -1.716094 -2.16657
elementType: O C H
totalener: -816.41307554 hartree
nucrepener: 1412.82928698 hartree
electener: -2229.24236251 hartree
oneelecener: -3910.95909537 hartree
twoeener: 1681.71673286 hartree
cpcmener: -0.02020359 hartree
kineticenergy: 812.45950166 hartree
xcener: -82.316623818827 hartree
chargesum: 0.0000000
charge: -0.298409 -0.515359 0.083568 -0.177994 -0.129323 -0.201081 0.080347 -0.128783 -0.320606 -0.311047 -0.301695 -0.133794 -0.147539 0.007564 -0.259073 -0.176627 0.487497 0.039184 -0.255413 0.044190 0.073984 0.076371 0.084045 0.071424 0.076409 0.075870 0.032684 0.088235 0.093569 0.085303 0.093680 0.091395 0.088340 0.084327 0.092602 0.090008 0.081475 0.088578 0.130521 0.115004 0.106739 0.108107 0.103312 0.115520 0.108941 0.086754 0.087501 0.095844 0.087849
qa: -0.2984 -0.5154 0.0836 -0.1780 -0.1293 -0.2011 0.0803 -0.1288 -0.3206 -0.3110 -0.3017 -0.1338 -0.1475 0.0076 -0.2591 -0.1766 0.4875 0.0392 -0.2554 0.0442 0.0740 0.0764 0.0840 0.0714 0.0764 0.0759 0.0327 0.0882 0.0936 0.0853 0.0937 0.0914 0.0883 0.0843 0.0926 0.0900 0.0815 0.0886 0.1305 0.1150 0.1067 0.1081 0.1033 0.1155 0.1089 0.0868 0.0875 0.0958 0.0878
va: 2.1135 1.9798 3.8015 3.8827 3.8708 3.9158 3.7717 3.9099 3.9491 3.9336 3.9306 3.8742 3.8848 3.7024 3.9208 3.7679 4.1471 3.8481 3.9155 1.0224 1.0046 1.0116 1.0127 1.0024 1.0098 1.0083 1.0152 1.0129 1.0079 1.0015 1.0022 1.0044 1.0030 1.0017 1.0050 1.0045 1.0040 1.0039 0.9922 1.0229 1.0357 0.9961 0.9961 1.0338 0.9957 1.0122 1.0141 1.0069 1.0043
dispcorr: -0.019844070 hartree
energy: -816.432919605044
dipole: -20.26780 19.20425 -1.06355 20.46225 -20.69311 -0.23085 -5.51219 4.93659 -0.57559
magnitude: 1.23115 au
magnitude: 3.12934 debye
