program: Orca
programVersion: 5.0.2
elementType: O O C C C C C C C C C C C C C C C C C H H H H H H H H H H H H H H H H H H H H H H H H H H H H H H
charge: 0
multiplicity: 1
keywords: wb97x-d3
keywords: def2-TZVPP
keywords: def2/J RIJCOSX
keywords: DEFGRID2
keywords: scfconv7
keywords: smallprint printgap noloewdin
keywords: NOSOSCF
formula: C17H30O2
InChI: InChI=1/C17H30O2/c1-6-19-17(18)13-16(5)12-8-11-15(4)10-7-9-14(2)3/h8,12-15H,6-7,9-11H2,1-5H3
49 atoms
O  4.248957 -3.173999 -0.048413
O  4.155194 -1.457837 1.383059
C  -3.238867 -0.065281 -0.57267
C  -3.713804 0.908667 0.511527
C  -3.911731 2.347396 0.037989
C  -2.596319 3.081016 -0.202569
C  -2.743434 4.561348 -0.557129
C  -2.618853 -1.331282 0.044315
C  -4.386136 -0.451122 -1.499131
C  -1.379423 5.241872 -0.563767
C  -3.441523 4.763206 -1.897464
C  -1.268897 -1.083826 0.626179
C  -0.161555 -1.732372 0.2481
C  1.18076 -1.482509 0.768369
C  1.334471 -0.388931 1.776329
C  2.171512 -2.264803 0.2851
C  3.595922 -2.219607 0.620379
C  5.668458 -3.291523 0.123282
C  6.432448 -2.319987 -0.747091
H  -2.464476 0.42108 -1.176196
H  -3.006867 0.922804 1.347382
H  -4.652225 0.523867 0.925166
H  -4.480402 2.892494 0.79803
H  -4.530081 2.361771 -0.864217
H  -1.986778 2.997051 0.704321
H  -2.024551 2.585761 -0.995907
H  -3.354216 5.034982 0.221103
H  -2.550659 -2.118955 -0.710588
H  -3.294024 -1.702435 0.825191
H  -5.156404 -1.003538 -0.955222
H  -4.861077 0.425099 -1.942942
H  -4.040308 -1.084061 -2.318052
H  -1.464131 6.307793 -0.783387
H  -0.725079 4.801769 -1.320542
H  -0.878543 5.142984 0.401205
H  -2.882372 4.280094 -2.703185
H  -4.451743 4.352337 -1.904986
H  -3.522113 5.823501 -2.144493
H  -1.203778 -0.310898 1.385841
H  -0.243165 -2.50778 -0.50867
H  0.734568 -0.608718 2.661196
H  0.957359 0.550701 1.368997
H  2.357676 -0.235113 2.09289
H  1.900958 -3.022365 -0.441315
H  5.894337 -4.317005 -0.165009
H  5.935588 -3.176831 1.174693
H  6.178547 -2.446362 -1.799607
H  6.251989 -1.282453 -0.468344
H  7.500491 -2.510844 -0.638188
elementType: O C H
totalener: -816.41338522 hartree
nucrepener: 1388.88337733 hartree
electener: -2205.29676255 hartree
oneelecener: -3863.06412888 hartree
twoeener: 1657.76736633 hartree
cpcmener: -0.02048755 hartree
kineticenergy: 812.44807149 hartree
xcener: -82.313083624476 hartree
chargesum: 0.0000000
charge: -0.298532 -0.515636 0.067115 -0.181023 -0.144341 -0.149535 0.069226 -0.116514 -0.313773 -0.295409 -0.302638 -0.130833 -0.155291 0.015730 -0.265125 -0.183089 0.490764 0.039240 -0.254875 0.050947 0.079519 0.083275 0.075684 0.067280 0.067633 0.065863 0.025703 0.080071 0.093368 0.083259 0.093384 0.092181 0.090466 0.081165 0.087506 0.082061 0.089458 0.090927 0.125431 0.115756 0.107514 0.105695 0.108424 0.115833 0.108621 0.086906 0.088163 0.087022 0.095428
qa: -0.2985 -0.5156 0.0671 -0.1810 -0.1443 -0.1495 0.0692 -0.1165 -0.3138 -0.2954 -0.3026 -0.1308 -0.1553 0.0157 -0.2651 -0.1831 0.4908 0.0392 -0.2549 0.0509 0.0795 0.0833 0.0757 0.0673 0.0676 0.0659 0.0257 0.0801 0.0934 0.0833 0.0934 0.0922 0.0905 0.0812 0.0875 0.0821 0.0895 0.0909 0.1254 0.1158 0.1075 0.1057 0.1084 0.1158 0.1086 0.0869 0.0882 0.0870 0.0954
va: 2.1139 1.9790 3.7556 3.9258 3.8982 3.8600 3.8225 3.9140 3.9438 3.9269 3.9280 3.8865 3.9261 3.7095 3.9204 3.7759 4.1451 3.8472 3.9171 1.0214 1.0094 1.0119 1.0102 1.0069 1.0134 1.0136 1.0188 1.0154 1.0049 1.0027 1.0019 1.0036 1.0048 1.0032 1.0050 1.0030 1.0027 1.0043 1.0010 1.0232 0.9952 0.9970 1.0359 1.0334 0.9955 1.0126 1.0042 1.0139 1.0070
dispcorr: -0.019160929 hartree
energy: -816.432546151336
dipole: -22.57447 21.46535 -1.10911 21.54839 -21.75829 -0.20990 -7.56885 7.05606 -0.51280
magnitude: 1.23982 au
magnitude: 3.15137 debye
