program: Orca
programVersion: 5.0.2
elementType: O O C C C C C C C C C C C C C C C C C H H H H H H H H H H H H H H H H H H H H H H H H H H H H H H
charge: 0
multiplicity: 1
keywords: wb97x-d3
keywords: def2-TZVPP
keywords: def2/J RIJCOSX
keywords: DEFGRID2
keywords: scfconv7
keywords: smallprint printgap noloewdin
keywords: NOSOSCF
formula: C17H30O2
InChI: InChI=1/C17H30O2/c1-6-19-17(18)13-16(5)12-8-11-15(4)10-7-9-14(2)3/h8,12-15H,6-7,9-11H2,1-5H3
49 atoms
O  3.720067 -0.60354 -0.68269
O  3.550786 -2.011504 1.047155
C  -3.449354 -0.351544 -0.767913
C  -3.096425 0.96228 -0.06067
C  -2.724318 2.088546 -1.015773
C  -2.404061 3.41011 -0.322952
C  -1.280044 3.365197 0.715518
C  -3.305228 -1.544004 0.175283
C  -4.862163 -0.310832 -1.339742
C  0.017469 2.810503 0.138815
C  -1.055712 4.756195 1.297271
C  -1.922715 -1.901955 0.614538
C  -0.782014 -1.408045 0.11991
C  0.558386 -1.774638 0.568572
C  0.671369 -2.776113 1.672656
C  1.588684 -1.163635 -0.058472
C  3.020326 -1.332744 0.190981
C  5.152877 -0.661183 -0.643236
C  5.695287 -1.876646 -1.360175
H  -2.756482 -0.489187 -1.60663
H  -2.265176 0.793464 0.628049
H  -3.943433 1.26935 0.564485
H  -3.540502 2.260538 -1.723759
H  -1.869868 1.770378 -1.622166
H  -2.141372 4.152319 -1.085453
H  -3.311313 3.785821 0.162612
H  -1.591338 2.710574 1.536911
H  -3.741814 -2.438773 -0.286069
H  -3.914115 -1.374272 1.07148
H  -5.00649 0.546468 -1.998844
H  -5.084671 -1.2087 -1.919041
H  -5.6044 -0.240685 -0.540818
H  0.347726 3.397732 -0.722202
H  -0.082278 1.773858 -0.18916
H  0.818626 2.835551 0.879965
H  -0.723766 5.456105 0.526159
H  -1.971143 5.159333 1.734945
H  -0.294547 4.744433 2.079664
H  -1.88049 -2.64606 1.403904
H  -0.818437 -0.665878 -0.671484
H  0.16789 -3.702784 1.392294
H  0.167108 -2.405953 2.567119
H  1.694415 -3.012787 1.93558
H  1.347464 -0.463039 -0.849855
H  5.508247 -0.615141 0.3870
H  5.476199 0.249572 -1.144617
H  5.348459 -1.915852 -2.392876
H  6.784141 -1.820949 -1.378461
H  5.420291 -2.807551 -0.865918
elementType: O C H
totalener: -816.41274778 hartree
nucrepener: 1455.95773336 hartree
electener: -2272.37048114 hartree
oneelecener: -3997.32967886 hartree
twoeener: 1724.95919772 hartree
cpcmener: -0.02057733 hartree
kineticenergy: 812.45347282 hartree
xcener: -82.318900378684 hartree
chargesum: 0.0000000
charge: -0.299810 -0.516015 0.107141 -0.217077 -0.116710 -0.199137 0.083299 -0.125067 -0.307170 -0.286154 -0.303053 -0.110775 -0.159817 0.003571 -0.271573 -0.169776 0.480458 0.040341 -0.255221 0.036570 0.087095 0.081268 0.083270 0.067056 0.075459 0.075449 0.034201 0.090949 0.087005 0.091758 0.091895 0.083340 0.089144 0.055047 0.093068 0.081396 0.088544 0.089979 0.126406 0.109091 0.106352 0.108246 0.105994 0.117857 0.086438 0.109086 0.087889 0.095510 0.087184
qa: -0.2998 -0.5160 0.1071 -0.2171 -0.1167 -0.1991 0.0833 -0.1251 -0.3072 -0.2862 -0.3031 -0.1108 -0.1598 0.0036 -0.2716 -0.1698 0.4805 0.0403 -0.2552 0.0366 0.0871 0.0813 0.0833 0.0671 0.0755 0.0754 0.0342 0.0909 0.0870 0.0918 0.0919 0.0833 0.0891 0.0550 0.0931 0.0814 0.0885 0.0900 0.1264 0.1091 0.1064 0.1082 0.1060 0.1179 0.0864 0.1091 0.0879 0.0955 0.0872
va: 2.1109 1.9788 3.7449 3.8749 3.8526 3.9157 3.7728 3.9734 3.9380 3.9391 3.9309 3.9014 3.8719 3.6729 3.9282 3.7526 4.1596 3.8474 3.9171 1.0193 0.9964 1.0140 1.0152 1.0046 1.0109 1.0088 1.0146 1.0040 1.0045 1.0035 1.0039 1.0028 1.0042 1.0055 1.0063 1.0037 1.0040 1.0044 1.0040 1.0201 0.9954 0.9954 1.0345 1.0287 1.0126 0.9956 1.0043 1.0070 1.0140
dispcorr: -0.021242431 hartree
energy: -816.433990210194
dipole: -16.32733 15.19013 -1.13721 14.03024 -13.79663 0.23361 -2.28442 1.72819 -0.55623
magnitude: 1.28733 au
magnitude: 3.27213 debye
