program: Orca
programVersion: 5.0.2
elementType: O O C C C C C C C C C C C C C C C C C H H H H H H H H H H H H H H H H H H H H H H H H H H H H H H
charge: 0
multiplicity: 1
keywords: wb97x-d3
keywords: def2-TZVPP
keywords: def2/J RIJCOSX
keywords: DEFGRID2
keywords: scfconv7
keywords: smallprint printgap noloewdin
keywords: NOSOSCF
formula: C17H30O2
InChI: InChI=1/C17H30O2/c1-6-19-17(18)13-16(5)12-8-11-15(4)10-7-9-14(2)3/h8,12-15H,6-7,9-11H2,1-5H3
49 atoms
O  4.017047 -2.370543 -0.275948
O  3.758139 -0.583303 1.034295
C  -3.715181 -0.632224 -0.69346
C  -3.769058 0.824711 -0.211777
C  -2.555918 1.662798 -0.606567
C  -2.543692 3.035109 0.053169
C  -1.299089 3.872727 -0.243979
C  -3.035349 -1.575688 0.318858
C  -5.111086 -1.160407 -1.000903
C  -1.187369 4.237261 -1.720053
C  -1.287363 5.131896 0.614828
C  -1.692607 -1.115166 0.772187
C  -0.53471 -1.637582 0.353199
C  0.787534 -1.147738 0.731179
C  0.846793 0.018109 1.665365
C  1.849585 -1.78525 0.190296
C  3.268436 -1.485901 0.38503
C  5.443861 -2.249253 -0.186922
C  6.050372 -3.370013 -0.992493
H  -3.127941 -0.66666 -1.618576
H  -3.90136 0.844067 0.876433
H  -4.661708 1.306704 -0.623212
H  -2.544454 1.761697 -1.695968
H  -1.630591 1.140827 -0.346459
H  -3.436114 3.599306 -0.244059
H  -2.621265 2.897791 1.137553
H  -0.421438 3.271691 0.025888
H  -2.957277 -2.570629 -0.126588
H  -3.692713 -1.663959 1.190748
H  -5.754683 -1.103227 -0.119784
H  -5.585168 -0.579396 -1.793524
H  -5.08629 -2.202907 -1.323922
H  -2.057148 4.814814 -2.044208
H  -1.117535 3.358319 -2.361996
H  -0.300877 4.845681 -1.908845
H  -0.390796 5.728977 0.437675
H  -2.151728 5.763546 0.394957
H  -1.317809 4.890816 1.679202
H  -1.683974 -0.284469 1.470758
H  -0.557934 -2.47534 -0.338425
H  1.85629 0.327174 1.904074
H  0.334095 -0.22256 2.598328
H  0.322004 0.873319 1.233195
H  1.649276 -2.622528 -0.468257
H  5.75569 -2.311288 0.857765
H  5.75844 -1.278445 -0.575527
H  5.765857 -3.311742 -2.043203
H  7.136409 -3.300318 -0.938037
H  5.760754 -4.347359 -0.606163
elementType: O C H
totalener: -816.41318292 hartree
nucrepener: 1419.96314156 hartree
electener: -2236.37632447 hartree
oneelecener: -3925.16127838 hartree
twoeener: 1688.78495391 hartree
cpcmener: -0.02100967 hartree
kineticenergy: 812.45847976 hartree
xcener: -82.314540565752 hartree
chargesum: 0.0000000
charge: -0.291984 -0.516415 0.099404 -0.190889 -0.132141 -0.159142 0.068903 -0.155909 -0.312194 -0.304399 -0.296759 -0.105878 -0.157871 0.018025 -0.250860 -0.175836 0.481172 0.040079 -0.253846 0.044633 0.074916 0.078359 0.078093 0.063805 0.071570 0.069682 0.027734 0.081409 0.090903 0.087801 0.089222 0.089190 0.082888 0.091090 0.091825 0.090306 0.081556 0.088027 0.126466 0.115794 0.109334 0.108725 0.092011 0.116213 0.095069 0.095618 0.087889 0.088558 0.087854
qa: -0.2920 -0.5164 0.0994 -0.1909 -0.1321 -0.1591 0.0689 -0.1559 -0.3122 -0.3044 -0.2968 -0.1059 -0.1579 0.0180 -0.2509 -0.1758 0.4812 0.0401 -0.2538 0.0446 0.0749 0.0784 0.0781 0.0638 0.0716 0.0697 0.0277 0.0814 0.0909 0.0878 0.0892 0.0892 0.0829 0.0911 0.0918 0.0903 0.0816 0.0880 0.1265 0.1158 0.1093 0.1087 0.0920 0.1162 0.0951 0.0956 0.0879 0.0886 0.0879
va: 2.1156 1.9834 3.7539 3.8856 3.8689 3.8741 3.8225 3.9637 3.9469 3.9274 3.9279 3.8854 3.9006 3.6968 3.9191 3.7810 4.1379 3.8449 3.9710 1.0225 1.0076 1.0077 1.0121 1.0103 1.0126 1.0116 1.0150 1.0155 1.0038 1.0003 1.0034 1.0043 1.0028 1.0021 1.0040 1.0049 1.0030 1.0047 0.9945 1.0228 1.0368 0.9968 0.9966 1.0324 0.9961 0.9960 1.0033 1.0066 1.0034
dispcorr: -0.019970835 hartree
energy: -816.433153751235
dipole: -19.44311 18.39793 -1.04518 15.32947 -15.87281 -0.54334 -5.01097 4.56858 -0.44239
magnitude: 1.25830 au
magnitude: 3.19836 debye
