program: Orca
programVersion: 5.0.2
elementType: O O C C C C C C C C C C C C C C C C C H H H H H H H H H H H H H H H H H H H H H H H H H H H H H H
charge: 0
multiplicity: 1
keywords: wb97x-d3
keywords: def2-TZVPP
keywords: def2/J RIJCOSX
keywords: DEFGRID2
keywords: scfconv7
keywords: smallprint printgap noloewdin
keywords: NOSOSCF
formula: C17H30O2
InChI: InChI=1/C17H30O2/c1-6-19-17(18)13-16(5)12-8-11-15(4)10-7-9-14(2)3/h8,12-15H,6-7,9-11H2,1-5H3
49 atoms
O  4.82102 -2.197056 0.907517
O  3.779831 -3.956506 -0.00136
C  -2.518019 0.478999 -0.661499
C  -3.301457 1.750738 -0.322787
C  -2.438373 2.918426 0.142699
C  -3.237454 4.126833 0.624406
C  -4.192796 4.751973 -0.394834
C  -1.974413 -0.188606 0.61434
C  -3.388752 -0.484262 -1.459669
C  -4.936183 5.923368 0.237113
C  -3.467557 5.200586 -1.658229
C  -1.019429 -1.300909 0.339024
C  0.290115 -1.226752 0.601583
C  1.273594 -2.26933 0.320438
C  0.779213 -3.53242 -0.308268
C  2.553386 -1.993261 0.655701
C  3.733872 -2.838754 0.471011
C  6.099216 -2.839288 0.795753
C  6.699852 -2.681769 -0.582582
H  -1.660479 0.764069 -1.283065
H  -4.05203 1.515136 0.44156
H  -3.863387 2.054663 -1.211386
H  -1.764651 3.20996 -0.668912
H  -1.789105 2.600178 0.962907
H  -3.812283 3.835502 1.510338
H  -2.5375 4.899859 0.961579
H  -4.937964 4.0010 -0.680166
H  -2.827146 -0.573541 1.185172
H  -1.481372 0.55509 1.24363
H  -3.739732 -0.019259 -2.382403
H  -2.8561 -1.394423 -1.739601
H  -4.269283 -0.781405 -0.884558
H  -5.48006 5.616908 1.13286
H  -5.659958 6.358959 -0.454382
H  -4.242005 6.715541 0.528919
H  -2.680157 5.921172 -1.421942
H  -3.002828 4.367156 -2.187369
H  -4.155052 5.682033 -2.356405
H  -1.428661 -2.197013 -0.116694
H  0.676131 -0.319658 1.058709
H  0.280417 -3.31125 -1.253479
H  0.032578 -4.00244 0.334509
H  1.562777 -4.254609 -0.499416
H  2.753851 -1.029004 1.1086
H  6.02418 -3.889881 1.07897
H  6.720312 -2.341754 1.53892
H  6.788961 -1.631137 -0.85898
H  7.702443 -3.110374 -0.582205
H  6.120674 -3.194713 -1.349487
elementType: O C H
totalener: -816.41383657 hartree
nucrepener: 1364.60195495 hartree
electener: -2181.01579152 hartree
oneelecener: -3814.45799079 hartree
twoeener: 1633.44219927 hartree
cpcmener: -0.02046346 hartree
kineticenergy: 812.44906997 hartree
xcener: -82.313970039448 hartree
chargesum: -0.0000000
charge: -0.298539 -0.515683 0.112647 -0.197133 -0.126781 -0.193871 0.072073 -0.133256 -0.311318 -0.299842 -0.307919 -0.133467 -0.156462 0.007820 -0.264240 -0.174436 0.487433 0.037889 -0.253982 0.044206 0.073536 0.075821 0.068780 0.083133 0.074549 0.077508 0.033837 0.092249 0.086090 0.090148 0.088483 0.085766 0.088861 0.089846 0.080944 0.085139 0.087807 0.092013 0.132621 0.113954 0.106697 0.107242 0.106492 0.116690 0.087036 0.108926 0.088063 0.095784 0.086844
qa: -0.2985 -0.5157 0.1126 -0.1971 -0.1268 -0.1939 0.0721 -0.1333 -0.3113 -0.2998 -0.3079 -0.1335 -0.1565 0.0078 -0.2642 -0.1744 0.4874 0.0379 -0.2540 0.0442 0.0735 0.0758 0.0688 0.0831 0.0745 0.0775 0.0338 0.0922 0.0861 0.0901 0.0885 0.0858 0.0889 0.0898 0.0809 0.0851 0.0878 0.0920 0.1326 0.1140 0.1067 0.1072 0.1065 0.1167 0.0870 0.1089 0.0881 0.0958 0.0868
va: 2.1137 1.9791 3.7687 3.9076 3.8665 3.9068 3.7844 3.9326 3.9498 3.9276 3.9333 3.8720 3.9312 3.7032 3.9240 3.7686 4.1459 3.8491 3.9166 1.0235 1.0091 1.0057 1.0038 1.0149 1.0086 1.0103 1.0150 1.0076 1.0196 1.0046 1.0041 1.0014 1.0043 1.0046 1.0040 1.0024 1.0009 1.0050 0.9951 1.0235 0.9958 0.9954 1.0353 1.0331 1.0123 0.9956 1.0042 1.0069 1.0138
dispcorr: -0.018979867 hartree
energy: -816.432816437729
dipole: -25.86852 25.16395 -0.70456 24.61883 -23.63396 0.98488 -6.46681 6.62107 0.15426
magnitude: 1.22073 au
magnitude: 3.10285 debye
