program: Orca
programVersion: 5.0.2
elementType: O O C C C C C C C C C C C C C C C C C H H H H H H H H H H H H H H H H H H H H H H H H H H H H H H
charge: 0
multiplicity: 1
keywords: wb97x-d3
keywords: def2-TZVPP
keywords: def2/J RIJCOSX
keywords: DEFGRID2
keywords: scfconv7
keywords: smallprint printgap noloewdin
keywords: NOSOSCF
formula: C17H30O2
InChI: InChI=1/C17H30O2/c1-6-19-17(18)13-16(5)12-8-11-15(4)10-7-9-14(2)3/h8,12-15H,6-7,9-11H2,1-5H3
49 atoms
O  4.005988 -2.330643 -0.304089
O  3.733016 -0.621937 1.104614
C  -3.721914 -0.627669 -0.711963
C  -3.764626 0.825458 -0.217605
C  -2.5416 1.654238 -0.601739
C  -2.513382 3.018475 0.074002
C  -1.255307 3.840825 -0.208605
C  -3.053166 -1.586276 0.293828
C  -5.121547 -1.140778 -1.027751
C  -1.127872 4.215267 -1.680931
C  -1.232496 5.093288 0.659657
C  -1.713085 -1.136625 0.765731
C  -0.551977 -1.652545 0.347593
C  0.766849 -1.168936 0.745332
C  0.817148 -0.025417 1.707353
C  1.833813 -1.788929 0.193776
C  3.250481 -1.489688 0.404404
C  5.431923 -2.200428 -0.212184
C  6.046568 -3.270733 -1.077953
H  -3.13223 -0.659047 -1.635653
H  -3.900709 0.836961 0.870272
H  -4.651254 1.319241 -0.628061
H  -2.528102 1.765627 -1.689925
H  -1.622674 1.118386 -0.3474
H  -3.39641 3.598858 -0.220153
H  -2.597127 2.870128 1.156504
H  -0.387938 3.225617 0.062743
H  -2.974898 -2.575668 -0.163706
H  -3.717593 -1.683333 1.15937
H  -5.58788 -0.549424 -1.817288
H  -5.105051 -2.180914 -1.358805
H  -5.767558 -1.08483 -0.148271
H  -1.987519 4.806618 -2.007317
H  -1.064858 3.340138 -2.328725
H  -0.232059 4.813263 -1.858791
H  -1.273822 4.844293 1.721823
H  -0.326449 5.679174 0.493607
H  -2.086302 5.738789 0.438768
H  -1.709353 -0.316211 1.476433
H  -0.569214 -2.47687 -0.360154
H  0.295665 -0.286655 2.629801
H  0.296296 0.839118 1.289089
H  1.824197 0.278499 1.962305
H  1.639705 -2.606525 -0.490841
H  5.747753 -2.3144 0.826874
H  5.735468 -1.20726 -0.549725
H  7.132044 -3.193189 -1.022945
H  5.767808 -4.269955 -0.743039
H  5.757961 -3.159977 -2.123312
elementType: O C H
totalener: -816.41311099 hartree
nucrepener: 1421.45370284 hartree
electener: -2237.86681382 hartree
oneelecener: -3928.14177893 hartree
twoeener: 1690.27496511 hartree
cpcmener: -0.02096758 hartree
kineticenergy: 812.45744952 hartree
xcener: -82.314404967887 hartree
chargesum: -0.0000000
charge: -0.291985 -0.516308 0.099710 -0.190831 -0.132292 -0.160049 0.068906 -0.157577 -0.312566 -0.304252 -0.296809 -0.103307 -0.159168 0.019203 -0.250624 -0.176791 0.481561 0.040523 -0.253965 0.044789 0.074891 0.078583 0.078496 0.063867 0.071925 0.069704 0.027836 0.081572 0.090881 0.089255 0.089193 0.087744 0.082993 0.091021 0.091847 0.088061 0.090286 0.081546 0.125788 0.115974 0.108868 0.091146 0.109412 0.116053 0.095158 0.095247 0.088637 0.087791 0.088055
qa: -0.2920 -0.5163 0.0997 -0.1908 -0.1323 -0.1600 0.0689 -0.1576 -0.3126 -0.3043 -0.2968 -0.1033 -0.1592 0.0192 -0.2506 -0.1768 0.4816 0.0405 -0.2540 0.0448 0.0749 0.0786 0.0785 0.0639 0.0719 0.0697 0.0278 0.0816 0.0909 0.0893 0.0892 0.0877 0.0830 0.0910 0.0918 0.0881 0.0903 0.0815 0.1258 0.1160 0.1089 0.0911 0.1094 0.1161 0.0952 0.0952 0.0886 0.0878 0.0881
va: 2.1159 1.9835 3.7535 3.8850 3.8687 3.8741 3.8220 3.9643 3.9473 3.9275 3.9279 3.8834 3.9015 3.6941 3.9189 3.7813 4.1385 3.8448 3.9710 1.0223 1.0077 1.0077 1.0118 1.0103 1.0126 1.0116 1.0148 1.0155 1.0036 1.0035 1.0043 1.0003 1.0028 1.0020 1.0040 1.0047 1.0049 1.0031 0.9951 1.0227 0.9972 0.9965 1.0370 1.0324 0.9963 0.9961 1.0065 1.0034 1.0032
dispcorr: -0.020011864 hartree
energy: -816.433122850523
dipole: -19.22862 18.18837 -1.04025 15.43054 -15.93719 -0.50666 -5.14368 4.64350 -0.50017
magnitude: 1.26056 au
magnitude: 3.20408 debye
