program: Orca
programVersion: 5.0.2
elementType: O O C C C C C C C C C C C C C C C C C H H H H H H H H H H H H H H H H H H H H H H H H H H H H H H
charge: 0
multiplicity: 1
keywords: wb97x-d3
keywords: def2-TZVPP
keywords: def2/J RIJCOSX
keywords: DEFGRID2
keywords: scfconv7
keywords: smallprint printgap noloewdin
keywords: NOSOSCF
formula: C17H30O2
InChI: InChI=1/C17H30O2/c1-6-19-17(18)13-16(5)12-8-11-15(4)10-7-9-14(2)3/h8,12-15H,6-7,9-11H2,1-5H3
49 atoms
O  4.818107 -2.189263 0.863308
O  3.765648 -3.97278 0.017312
C  -2.419917 0.534568 -0.672574
C  -3.276059 1.761569 -0.347803
C  -2.521654 2.907931 0.315345
C  -3.410462 4.081823 0.718883
C  -4.202575 4.746395 -0.409334
C  -1.979892 -0.190129 0.612084
C  -3.174715 -0.402717 -1.607445
C  -5.038746 5.893271 0.1465
C  -3.29709 5.240121 -1.530856
C  -1.029863 -1.311269 0.35408
C  0.280195 -1.23648 0.613487
C  1.26179 -2.281995 0.33787
C  0.762846 -3.55415 -0.268069
C  2.54539 -1.997836 0.650648
C  3.725029 -2.843253 0.46096
C  6.095085 -2.832088 0.743701
C  6.667092 -2.714703 -0.650804
H  -1.514407 0.877994 -1.18741
H  -4.115735 1.453875 0.287492
H  -3.722453 2.120189 -1.28055
H  -1.728717 3.250392 -0.356832
H  -2.011974 2.551523 1.214402
H  -4.113727 3.742581 1.487425
H  -2.786648 4.844793 1.198597
H  -4.893396 4.008532 -0.832375
H  -2.875823 -0.576118 1.1108
H  -1.513764 0.520857 1.297193
H  -4.088425 -0.771891 -1.135034
H  -3.463424 0.112541 -2.525046
H  -2.580249 -1.270178 -1.897839
H  -4.401675 6.672369 0.572943
H  -5.713192 5.552341 0.934594
H  -5.649267 6.356793 -0.630736
H  -2.556468 5.949845 -1.152858
H  -2.755534 4.425779 -2.014704
H  -3.873997 5.748881 -2.30555
H  -1.442427 -2.211856 -0.088976
H  0.668523 -0.324333 1.058614
H  1.545005 -4.278941 -0.453624
H  0.258083 -3.346666 -1.213208
H  0.020371 -4.013643 0.386749
H  2.750158 -1.025809 1.084499
H  6.028591 -3.874041 1.059636
H  6.730073 -2.311351 1.458623
H  6.076346 -3.255384 -1.389297
H  6.742529 -1.672627 -0.961589
H  7.672525 -3.136482 -0.657551
elementType: O C H
totalener: -816.41376203 hartree
nucrepener: 1366.07560911 hartree
electener: -2182.48937114 hartree
oneelecener: -3817.40574357 hartree
twoeener: 1634.91637243 hartree
cpcmener: -0.02040925 hartree
kineticenergy: 812.45701083 hartree
xcener: -82.315744635120 hartree
chargesum: 0.0000000
charge: -0.298640 -0.515522 0.115885 -0.198190 -0.123634 -0.198561 0.075159 -0.135960 -0.315802 -0.300296 -0.308036 -0.136060 -0.152355 0.007239 -0.262785 -0.174237 0.487004 0.037837 -0.254084 0.045200 0.074452 0.075449 0.069129 0.083289 0.073843 0.077500 0.033497 0.092871 0.085504 0.085654 0.090641 0.090269 0.081265 0.088192 0.090034 0.085343 0.087387 0.092370 0.132307 0.113786 0.106270 0.106419 0.107179 0.116684 0.087051 0.108821 0.086898 0.087877 0.095861
qa: -0.2986 -0.5155 0.1159 -0.1982 -0.1236 -0.1986 0.0752 -0.1360 -0.3158 -0.3003 -0.3080 -0.1361 -0.1524 0.0072 -0.2628 -0.1742 0.4870 0.0378 -0.2541 0.0452 0.0745 0.0754 0.0691 0.0833 0.0738 0.0775 0.0335 0.0929 0.0855 0.0857 0.0906 0.0903 0.0813 0.0882 0.0900 0.0853 0.0874 0.0924 0.1323 0.1138 0.1063 0.1064 0.1072 0.1167 0.0871 0.1088 0.0869 0.0879 0.0959
va: 2.1134 1.9793 3.7656 3.9033 3.8659 3.9102 3.7820 3.9336 3.9502 3.9287 3.9339 3.8692 3.9152 3.7040 3.9237 3.7687 4.1453 3.8496 3.9159 1.0235 1.0095 1.0066 1.0036 1.0159 1.0085 1.0099 1.0148 1.0081 1.0200 1.0009 1.0047 1.0027 1.0038 1.0043 1.0044 1.0023 1.0008 1.0050 0.9943 1.0233 1.0353 0.9959 0.9957 1.0331 1.0122 0.9957 1.0140 1.0044 1.0070
dispcorr: -0.019053383 hartree
energy: -816.432815411897
dipole: -25.65690 24.95760 -0.69929 24.68696 -23.68792 0.99904 -6.56367 6.68616 0.12249
magnitude: 1.22560 au
magnitude: 3.11522 debye
