program: Orca
programVersion: 5.0.2
elementType: O O C C C C C C C C C C C C C C C C C H H H H H H H H H H H H H H H H H H H H H H H H H H H H H H
charge: 0
multiplicity: 1
keywords: wb97x-d3
keywords: def2-TZVPP
keywords: def2/J RIJCOSX
keywords: DEFGRID2
keywords: scfconv7
keywords: smallprint printgap noloewdin
keywords: NOSOSCF
formula: C17H30O2
InChI: InChI=1/C17H30O2/c1-6-19-17(18)13-16(5)12-8-11-15(4)10-7-9-14(2)3/h8,12-15H,6-7,9-11H2,1-5H3
49 atoms
O  4.454609 -2.102893 -0.598356
O  3.976152 -1.938984 1.57975
C  -2.998308 0.068147 -0.684553
C  -3.239556 0.821878 0.624747
C  -3.603753 2.296725 0.467237
C  -2.534316 3.110282 -0.253619
C  -2.764755 4.621921 -0.24084
C  -2.604056 -1.398318 -0.429443
C  -4.212723 0.119701 -1.602416
C  -1.565579 5.344479 -0.843439
C  -4.042315 5.012552 -0.975307
C  -1.369432 -1.531619 0.399168
C  -0.149985 -1.70203 -0.123257
C  1.093675 -1.772645 0.638481
C  0.995036 -1.681387 2.127195
C  2.231924 -1.907021 -0.07747
C  3.604338 -1.982292 0.42462
C  5.85716 -2.219541 -0.318939
C  6.250002 -3.629173 0.059837
H  -2.154609 0.533273 -1.206402
H  -2.343739 0.756443 1.250818
H  -4.035509 0.311844 1.179381
H  -3.759011 2.720034 1.464936
H  -4.563475 2.390954 -0.047224
H  -1.563523 2.898073 0.208888
H  -2.448775 2.78098 -1.29555
H  -2.861449 4.938961 0.804675
H  -2.452631 -1.889033 -1.394316
H  -3.436832 -1.908677 0.064836
H  -5.097719 -0.288024 -1.107574
H  -4.447713 1.138994 -1.911483
H  -4.044104 -0.461647 -2.510676
H  -1.69143 6.428292 -0.809522
H  -1.424011 5.06307 -1.89004
H  -0.643798 5.10322 -0.310442
H  -4.007036 4.683676 -2.017385
H  -4.932384 4.574959 -0.52162
H  -4.18024 6.095489 -0.977325
H  -1.488469 -1.445133 1.474139
H  -0.053849 -1.786345 -1.202498
H  0.53553 -0.733865 2.414509
H  1.951416 -1.759446 2.627873
H  0.345276 -2.470677 2.508844
H  2.140265 -1.963027 -1.155981
H  6.152761 -1.504204 0.449797
H  6.345209 -1.926326 -1.246957
H  7.333736 -3.677335 0.170275
H  5.807106 -3.944719 1.003634
H  5.963487 -4.341667 -0.713749
elementType: O C H
totalener: -816.41375399 hartree
nucrepener: 1392.20438918 hartree
electener: -2208.61814317 hartree
oneelecener: -3869.76044516 hartree
twoeener: 1661.14230200 hartree
cpcmener: -0.02010564 hartree
kineticenergy: 812.46112916 hartree
xcener: -82.316762104629 hartree
chargesum: 0.0000000
charge: -0.299324 -0.515865 0.089796 -0.198898 -0.137981 -0.159835 0.069396 -0.143030 -0.326588 -0.295426 -0.303343 -0.118656 -0.151447 0.004677 -0.260524 -0.177136 0.488960 0.039124 -0.254456 0.050086 0.077476 0.082902 0.077789 0.073261 0.074091 0.066445 0.026681 0.085812 0.093611 0.089707 0.089554 0.093195 0.089966 0.080370 0.087996 0.081096 0.090124 0.091970 0.131944 0.115149 0.106254 0.106799 0.106247 0.115978 0.086862 0.109015 0.095817 0.086582 0.087778
qa: -0.2993 -0.5159 0.0898 -0.1989 -0.1380 -0.1598 0.0694 -0.1430 -0.3266 -0.2954 -0.3033 -0.1187 -0.1514 0.0047 -0.2605 -0.1771 0.4890 0.0391 -0.2545 0.0501 0.0775 0.0829 0.0778 0.0733 0.0741 0.0664 0.0267 0.0858 0.0936 0.0897 0.0896 0.0932 0.0900 0.0804 0.0880 0.0811 0.0901 0.0920 0.1319 0.1151 0.1063 0.1068 0.1062 0.1160 0.0869 0.1090 0.0958 0.0866 0.0878
va: 2.1138 1.9789 3.7546 3.9270 3.8784 3.8621 3.8218 3.9179 3.9581 3.9288 3.9277 3.8643 3.8933 3.7048 3.9221 3.7707 4.1436 3.8483 3.9158 1.0191 1.0091 1.0098 1.0116 1.0010 1.0116 1.0106 1.0190 1.0140 1.0081 1.0008 1.0000 1.0054 1.0051 1.0032 1.0050 1.0036 1.0027 1.0047 0.9925 1.0229 0.9965 1.0353 0.9964 1.0335 1.0123 0.9958 1.0069 1.0144 1.0043
dispcorr: -0.019463130 hartree
energy: -816.433217120841
dipole: -23.47662 22.52631 -0.95031 19.13823 -19.05024 0.08799 -4.52483 3.82143 -0.70341
magnitude: 1.18558 au
magnitude: 3.01351 debye
