program: Orca
programVersion: 5.0.2
elementType: O O C C C C C C C C C C C C C C C C C H H H H H H H H H H H H H H H H H H H H H H H H H H H H H H
charge: 0
multiplicity: 1
keywords: wb97x-d3
keywords: def2-TZVPP
keywords: def2/J RIJCOSX
keywords: DEFGRID2
keywords: scfconv7
keywords: smallprint printgap noloewdin
keywords: NOSOSCF
formula: C17H30O2
InChI: InChI=1/C17H30O2/c1-6-19-17(18)13-16(5)12-8-11-15(4)10-7-9-14(2)3/h8,12-15H,6-7,9-11H2,1-5H3
49 atoms
O  4.380916 -1.308164 0.163862
O  3.401592 -3.02887 1.204324
C  -3.614624 0.067178 -0.23899
C  -3.004753 0.904394 0.886722
C  -2.143707 2.088924 0.45466
C  -2.888009 3.120343 -0.384419
C  -2.069546 4.359772 -0.75324
C  -2.551939 -0.485165 -1.205986
C  -4.48498 -1.043408 0.339648
C  -2.838364 5.221125 -1.748554
C  -1.68767 5.186207 0.470168
C  -1.517319 -1.325113 -0.537146
C  -0.205888 -1.061211 -0.559861
C  0.826132 -1.857387 0.09959
C  0.380211 -3.058099 0.870839
C  2.10114 -1.430256 -0.038745
C  3.314266 -2.031118 0.517673
C  5.680939 -1.741358 0.589652
C  6.24464 -2.823937 -0.302219
H  -4.267037 0.710715 -0.837845
H  -2.407755 0.248542 1.529969
H  -3.819189 1.276407 1.517441
H  -1.266218 1.739092 -0.098507
H  -1.752733 2.561983 1.359221
H  -3.234295 2.649842 -1.310216
H  -3.79295 3.438262 0.148202
H  -1.146385 4.022415 -1.239855
H  -2.072203 0.335131 -1.745255
H  -3.066017 -1.092405 -1.959328
H  -3.917489 -1.714615 0.987738
H  -5.295573 -0.627118 0.940334
H  -4.937449 -1.648526 -0.448211
H  -2.26545 6.102027 -2.044541
H  -3.778978 5.572101 -1.316181
H  -3.081259 4.665557 -2.656399
H  -1.075157 4.626978 1.178268
H  -1.119387 6.073239 0.183655
H  -2.57995 5.526577 1.002548
H  -1.878937 -2.197365 -0.001006
H  0.139936 -0.18531 -1.102246
H  -0.32157 -2.759953 1.651819
H  1.194064 -3.599242 1.33588
H  -0.156606 -3.747064 0.216411
H  2.268226 -0.536457 -0.628903
H  5.653048 -2.060222 1.632463
H  6.298305 -0.846289 0.535388
H  6.292756 -2.498224 -1.341239
H  7.260532 -3.054041 0.020033
H  5.665843 -3.745404 -0.253681
elementType: O C H
totalener: -816.41395790 hartree
nucrepener: 1412.00337171 hartree
electener: -2228.41732961 hartree
oneelecener: -3909.30768366 hartree
twoeener: 1680.89035405 hartree
cpcmener: -0.02039981 hartree
kineticenergy: 812.45047294 hartree
xcener: -82.316845851339 hartree
chargesum: 0.0000000
charge: -0.299313 -0.515419 0.081682 -0.211244 -0.129622 -0.169805 0.068180 -0.118536 -0.315884 -0.293465 -0.305563 -0.149296 -0.156871 0.013987 -0.264772 -0.180680 0.489360 0.039550 -0.254963 0.049972 0.083391 0.083573 0.066863 0.083252 0.071419 0.071696 0.028578 0.087941 0.099787 0.080543 0.093746 0.094953 0.089916 0.080190 0.087353 0.090695 0.090939 0.081998 0.134308 0.116934 0.107245 0.107739 0.107506 0.116250 0.086248 0.108952 0.088208 0.095506 0.086971
qa: -0.2993 -0.5154 0.0817 -0.2112 -0.1296 -0.1698 0.0682 -0.1185 -0.3159 -0.2935 -0.3056 -0.1493 -0.1569 0.0140 -0.2648 -0.1807 0.4894 0.0395 -0.2550 0.0500 0.0834 0.0836 0.0669 0.0833 0.0714 0.0717 0.0286 0.0879 0.0998 0.0805 0.0937 0.0950 0.0899 0.0802 0.0874 0.0907 0.0909 0.0820 0.1343 0.1169 0.1072 0.1077 0.1075 0.1163 0.0862 0.1090 0.0882 0.0955 0.0870
va: 2.1131 1.9791 3.7587 3.9251 3.8715 3.8705 3.8211 3.9064 3.9475 3.9256 3.9303 3.8543 3.9065 3.7031 3.9181 3.7721 4.1458 3.8477 3.9163 1.0127 1.0057 1.0073 1.0060 1.0126 1.0092 1.0121 1.0183 1.0091 1.0061 1.0006 1.0042 1.0040 1.0051 1.0031 1.0051 1.0032 1.0041 1.0026 0.9911 1.0202 0.9960 1.0356 0.9957 1.0336 1.0129 0.9957 1.0041 1.0069 1.0142
dispcorr: -0.020127438 hartree
energy: -816.434085339977
dipole: -20.98437 20.22354 -0.76083 18.07437 -17.33670 0.73767 -2.62017 1.97457 -0.64560
magnitude: 1.24089 au
magnitude: 3.15410 debye
