program: Orca
programVersion: 5.0.2
elementType: O O C C C C C C C C C C C C C C C C C H H H H H H H H H H H H H H H H H H H H H H H H H H H H H H
charge: 0
multiplicity: 1
keywords: wb97x-d3
keywords: def2-TZVPP
keywords: def2/J RIJCOSX
keywords: DEFGRID2
keywords: scfconv7
keywords: smallprint printgap noloewdin
keywords: NOSOSCF
formula: C17H30O2
InChI: InChI=1/C17H30O2/c1-6-19-17(18)13-16(5)12-8-11-15(4)10-7-9-14(2)3/h8,12-15H,6-7,9-11H2,1-5H3
49 atoms
O  3.864487 -1.319748 1.160157
O  3.485309 -1.939927 -0.955448
C  -4.079667 -0.31383 -0.231217
C  -3.332366 0.981303 -0.568179
C  -2.830348 1.782716 0.627209
C  -2.22826 3.133028 0.242034
C  -1.015748 3.091799 -0.691075
C  -3.218255 -1.307112 0.564416
C  -5.393046 -0.057889 0.498574
C  -0.56175 4.509664 -1.018826
C  0.136546 2.288114 -0.099842
C  -1.927582 -1.613569 -0.112446
C  -0.726275 -1.445659 0.450777
C  0.556299 -1.688591 -0.202975
C  0.527057 -2.137957 -1.628329
C  1.662637 -1.465447 0.540667
C  3.060593 -1.607787 0.13276
C  5.284364 -1.370864 0.960473
C  5.816488 -0.110319 0.317673
H  -4.321644 -0.793155 -1.186874
H  -3.997891 1.614587 -1.16541
H  -2.489749 0.738866 -1.223464
H  -2.098422 1.198926 1.19315
H  -3.657051 1.969552 1.318485
H  -3.008619 3.743078 -0.226422
H  -1.940755 3.663816 1.156863
H  -1.313535 2.614094 -1.631103
H  -3.790229 -2.235055 0.676516
H  -3.034113 -0.931441 1.574605
H  -5.233457 0.372195 1.488975
H  -6.028754 0.630292 -0.061528
H  -5.952601 -0.985124 0.63538
H  -0.234422 5.036271 -0.118829
H  -1.367304 5.094836 -1.466814
H  0.273777 4.508645 -1.721373
H  0.449693 2.7003 0.863103
H  -0.12862 1.242175 0.060911
H  1.005266 2.300719 -0.760963
H  -2.003481 -1.975015 -1.134256
H  -0.679264 -1.08133 1.47337
H  1.510007 -2.301791 -2.049829
H  0.0130 -1.395117 -2.240949
H  -0.042086 -3.064462 -1.719398
H  1.519387 -1.138618 1.564199
H  5.55589 -2.256176 0.383894
H  5.697203 -1.4898 1.960958
H  5.566924 0.77186 0.907261
H  6.903573 -0.173784 0.26038
H  5.440016 0.031399 -0.694633
elementType: O C H
totalener: -816.41404741 hartree
nucrepener: 1468.78310938 hartree
electener: -2285.19715678 hartree
oneelecener: -4023.03662832 hartree
twoeener: 1737.83947154 hartree
cpcmener: -0.02019308 hartree
kineticenergy: 812.45961287 hartree
xcener: -82.320093190675 hartree
chargesum: -0.0000000
charge: -0.299247 -0.516006 0.070422 -0.162725 -0.150295 -0.196393 0.079943 -0.135281 -0.328608 -0.305205 -0.276059 -0.105962 -0.176735 0.005553 -0.261128 -0.190102 0.500049 0.039347 -0.255658 0.052926 0.086758 0.078463 0.070542 0.088021 0.074419 0.077788 0.034946 0.098731 0.081818 0.083665 0.094612 0.094835 0.081922 0.087970 0.090710 0.088494 0.045053 0.092962 0.130527 0.123672 0.107339 0.106340 0.108225 0.116433 0.086956 0.108825 0.088435 0.095602 0.087099
qa: -0.2992 -0.5160 0.0704 -0.1627 -0.1503 -0.1964 0.0799 -0.1353 -0.3286 -0.3052 -0.2761 -0.1060 -0.1767 0.0056 -0.2611 -0.1901 0.5000 0.0393 -0.2557 0.0529 0.0868 0.0785 0.0705 0.0880 0.0744 0.0778 0.0349 0.0987 0.0818 0.0837 0.0946 0.0948 0.0819 0.0880 0.0907 0.0885 0.0451 0.0930 0.1305 0.1237 0.1073 0.1063 0.1082 0.1164 0.0870 0.1088 0.0884 0.0956 0.0871
va: 2.1147 1.9787 3.8079 3.8681 3.8600 3.9189 3.7911 3.9162 3.9500 3.9336 3.9284 3.8439 3.8698 3.6646 3.9180 3.7418 4.1377 3.8464 3.9176 1.0137 1.0074 1.0076 1.0024 1.0108 1.0093 1.0106 1.0153 1.0062 1.0063 0.9985 1.0030 1.0035 1.0034 1.0047 1.0039 1.0056 1.0099 1.0073 1.0002 1.0194 1.0353 0.9962 0.9962 1.0345 1.0126 0.9957 1.0042 1.0068 1.0141
dispcorr: -0.022302058 hartree
energy: -816.436349464673
dipole: -16.28191 15.20028 -1.08163 17.38855 -17.11900 0.26955 -1.63256 2.18141 0.54885
magnitude: 1.24250 au
magnitude: 3.15819 debye
