program: Orca
programVersion: 5.0.2
elementType: O O C C C C C C C C C C C C C C C C C H H H H H H H H H H H H H H H H H H H H H H H H H H H H H H
charge: 0
multiplicity: 1
keywords: wb97x-d3
keywords: def2-TZVPP
keywords: def2/J RIJCOSX
keywords: DEFGRID2
keywords: scfconv7
keywords: smallprint printgap noloewdin
keywords: NOSOSCF
formula: C17H30O2
InChI: InChI=1/C17H30O2/c1-6-19-17(18)13-16(5)12-8-11-15(4)10-7-9-14(2)3/h8,12-15H,6-7,9-11H2,1-5H3
49 atoms
O  3.840169 -1.257217 1.137804
O  3.465253 -1.942883 -0.958337
C  -4.07606 -0.30096 -0.25232
C  -3.305483 0.984764 -0.572693
C  -2.810752 1.77458 0.63354
C  -2.183747 3.11771 0.263264
C  -0.953184 3.062653 -0.645307
C  -3.239741 -1.312404 0.547635
C  -5.393889 -0.029151 0.463658
C  -0.47586 4.475243 -0.96293
C  0.176749 2.24468 -0.031085
C  -1.949214 -1.639521 -0.119721
C  -0.749032 -1.474458 0.446642
C  0.534859 -1.726449 -0.200959
C  0.508689 -2.220511 -1.611505
C  1.639515 -1.465897 0.533085
C  3.038397 -1.591444 0.122966
C  5.259863 -1.275156 0.931792
C  5.752859 -0.020543 0.247371
H  -4.314165 -0.770942 -1.213582
H  -3.953358 1.629865 -1.176603
H  -2.456713 0.733666 -1.216614
H  -2.096394 1.178385 1.208844
H  -3.645654 1.970589 1.312281
H  -2.946819 3.73858 -0.219255
H  -1.907678 3.643059 1.184739
H  -1.237614 2.58875 -1.591381
H  -3.829451 -2.230025 0.651966
H  -3.057376 -0.942681 1.560321
H  -5.239469 0.389664 1.459693
H  -6.011081 0.674384 -0.09808
H  -5.970431 -0.948021 0.585398
H  -0.160223 4.997279 -0.056102
H  -1.265412 5.07028 -1.42619
H  0.373356 4.464862 -1.648782
H  -0.107364 1.203423 0.1262
H  1.05803 2.243616 -0.675459
H  0.476783 2.654497 0.937024
H  -2.024034 -2.010248 -1.138259
H  -0.703968 -1.097439 1.464705
H  1.4919 -2.41291 -2.020211
H  0.010901 -1.489745 -2.251645
H  -0.07426 -3.140401 -1.677179
H  1.49358 -1.111091 1.546884
H  5.553428 -2.17016 0.381608
H  5.680446 -1.351195 1.933188
H  5.370332 0.077389 -0.767788
H  5.478032 0.872076 0.809406
H  6.841212 -0.053272 0.188858
elementType: O C H
totalener: -816.41400920 hartree
nucrepener: 1471.38527365 hartree
electener: -2287.79928285 hartree
oneelecener: -4028.24467208 hartree
twoeener: 1740.44538923 hartree
cpcmener: -0.02022427 hartree
kineticenergy: 812.46021989 hartree
xcener: -82.320275995965 hartree
chargesum: -0.0000000
charge: -0.299248 -0.516060 0.071556 -0.163894 -0.151015 -0.195799 0.080112 -0.135937 -0.329117 -0.305119 -0.276721 -0.105782 -0.176582 0.011064 -0.262876 -0.195297 0.500794 0.038986 -0.255313 0.053204 0.086699 0.078832 0.070560 0.088170 0.074480 0.077851 0.035187 0.098621 0.081938 0.083636 0.094646 0.094896 0.081836 0.087874 0.090724 0.044808 0.093113 0.088694 0.130462 0.123705 0.107022 0.107325 0.107917 0.117056 0.087419 0.108538 0.086973 0.088520 0.095542
qa: -0.2992 -0.5161 0.0716 -0.1639 -0.1510 -0.1958 0.0801 -0.1359 -0.3291 -0.3051 -0.2767 -0.1058 -0.1766 0.0111 -0.2629 -0.1953 0.5008 0.0390 -0.2553 0.0532 0.0867 0.0788 0.0706 0.0882 0.0745 0.0779 0.0352 0.0986 0.0819 0.0836 0.0946 0.0949 0.0818 0.0879 0.0907 0.0448 0.0931 0.0887 0.1305 0.1237 0.1070 0.1073 0.1079 0.1171 0.0874 0.1085 0.0870 0.0885 0.0955
va: 2.1141 1.9787 3.8052 3.8673 3.8612 3.9188 3.7904 3.9165 3.9501 3.9339 3.9277 3.8453 3.8726 3.6546 3.9189 3.7435 4.1366 3.8470 3.9172 1.0137 1.0075 1.0077 1.0023 1.0107 1.0093 1.0107 1.0154 1.0063 1.0063 0.9984 1.0030 1.0035 1.0034 1.0047 1.0039 1.0098 1.0073 1.0057 1.0004 1.0194 1.0351 0.9959 0.9963 1.0344 1.0122 0.9957 1.0142 1.0042 1.0069
dispcorr: -0.022380641 hartree
energy: -816.436389841562
dipole: -16.08467 15.00151 -1.08317 17.36344 -17.06598 0.29746 -1.55708 2.09398 0.53689
magnitude: 1.24498 au
magnitude: 3.16450 debye
