program: Orca
programVersion: 5.0.2
elementType: O O C C C C C C C C C C C C C C C C C H H H H H H H H H H H H H H H H H H H H H H H H H H H H H H
charge: 0
multiplicity: 1
keywords: wb97x-d3
keywords: def2-TZVPP
keywords: def2/J RIJCOSX
keywords: DEFGRID2
keywords: scfconv7
keywords: smallprint printgap noloewdin
keywords: NOSOSCF
formula: C17H30O2
InChI: InChI=1/C17H30O2/c1-6-19-17(18)13-16(5)12-8-11-15(4)10-7-9-14(2)3/h8,12-15H,6-7,9-11H2,1-5H3
49 atoms
O  4.129904 -1.159641 0.991443
O  3.652851 -2.319786 -0.861464
C  -3.776681 -0.253583 -0.169166
C  -2.963114 0.968683 -0.606508
C  -2.516789 1.897199 0.519208
C  -1.467802 2.916624 0.082241
C  -1.86981 3.844694 -1.06561
C  -2.976206 -1.208861 0.732689
C  -5.083415 0.136034 0.511193
C  -3.111233 4.662515 -0.731242
C  -0.706808 4.760941 -1.427932
C  -1.715708 -1.676459 0.091906
C  -0.48943 -1.413898 0.557228
C  0.760795 -1.830526 -0.072832
C  0.665626 -2.638944 -1.32699
C  1.90251 -1.437344 0.534405
C  3.279577 -1.705679 0.117746
C  5.539529 -1.328391 0.78675
C  6.035888 -2.656406 1.311013
H  -4.0284 -0.807393 -1.081037
H  -3.561331 1.532578 -1.328957
H  -2.079882 0.627965 -1.15756
H  -2.089359 1.31188 1.338227
H  -3.383445 2.41073 0.944712
H  -1.189704 3.532582 0.945167
H  -0.559634 2.375493 -0.206346
H  -2.094792 3.231672 -1.945469
H  -3.60739 -2.077797 0.947626
H  -2.759838 -0.73588 1.693987
H  -4.910177 0.636079 1.465953
H  -5.667745 0.813031 -0.114887
H  -5.699525 -0.742557 0.710789
H  -3.363016 5.346663 -1.543839
H  -2.953071 5.264051 0.167914
H  -3.985802 4.033551 -0.557007
H  -0.437505 5.405337 -0.587153
H  0.182406 4.189407 -1.701485
H  -0.954387 5.407767 -2.271668
H  -1.83695 -2.244968 -0.826083
H  -0.393348 -0.83489 1.471815
H  0.07131 -3.536825 -1.150802
H  1.628479 -2.940621 -1.718598
H  0.147474 -2.068877 -2.10029
H  1.809548 -0.852637 1.442309
H  5.996058 -0.508313 1.338637
H  5.790429 -1.197565 -0.266764
H  7.120846 -2.694933 1.2094
H  5.797122 -2.77969 2.367462
H  5.621863 -3.50047 0.760596
elementType: O C H
totalener: -816.41365540 hartree
nucrepener: 1426.29302280 hartree
electener: -2242.70667820 hartree
oneelecener: -3937.99439423 hartree
twoeener: 1695.28771603 hartree
cpcmener: -0.02021438 hartree
kineticenergy: 812.45569613 hartree
xcener: -82.317767962498 hartree
chargesum: -0.0000000
charge: -0.298650 -0.516049 0.087855 -0.186885 -0.160977 -0.192732 0.077765 -0.153907 -0.329617 -0.308047 -0.300183 -0.109664 -0.167799 0.014478 -0.261432 -0.182443 0.490751 0.038704 -0.254096 0.054491 0.087237 0.085473 0.088614 0.082269 0.078280 0.072122 0.034353 0.098442 0.085211 0.084840 0.094492 0.095889 0.092881 0.084497 0.086944 0.081079 0.088582 0.089867 0.128834 0.116058 0.106624 0.106223 0.108037 0.115828 0.108585 0.086875 0.095429 0.088386 0.086487
qa: -0.2986 -0.5160 0.0879 -0.1869 -0.1610 -0.1927 0.0778 -0.1539 -0.3296 -0.3080 -0.3002 -0.1097 -0.1678 0.0145 -0.2614 -0.1824 0.4908 0.0387 -0.2541 0.0545 0.0872 0.0855 0.0886 0.0823 0.0783 0.0721 0.0344 0.0984 0.0852 0.0848 0.0945 0.0959 0.0929 0.0845 0.0869 0.0811 0.0886 0.0899 0.1288 0.1161 0.1066 0.1062 0.1080 0.1158 0.1086 0.0869 0.0954 0.0884 0.0865
va: 2.1133 1.9785 3.7892 3.8857 3.8576 3.9142 3.7792 3.9347 3.9492 3.9344 3.9295 3.8422 3.9071 3.7041 3.9184 3.7711 4.1449 3.8490 3.9171 1.0139 1.0060 1.0066 1.0093 1.0001 1.0100 1.0091 1.0163 1.0073 1.0066 0.9963 1.0032 1.0043 1.0050 1.0026 1.0013 1.0038 1.0047 1.0043 1.0015 1.0212 0.9964 1.0350 0.9957 1.0337 0.9955 1.0125 1.0071 1.0041 1.0137
dispcorr: -0.020539427 hartree
energy: -816.434194827711
dipole: -20.05223 19.03007 -1.02215 17.44194 -17.11822 0.32372 -1.47801 2.05013 0.57211
magnitude: 1.21528 au
magnitude: 3.08900 debye
