program: Orca
programVersion: 5.0.2
elementType: O O C C C C C C C C C C C C C C C C C H H H H H H H H H H H H H H H H H H H H H H H H H H H H H H
charge: 0
multiplicity: 1
keywords: wb97x-d3
keywords: def2-TZVPP
keywords: def2/J RIJCOSX
keywords: DEFGRID2
keywords: scfconv7
keywords: smallprint printgap noloewdin
keywords: NOSOSCF
formula: C17H30O2
InChI: InChI=1/C17H30O2/c1-6-19-17(18)13-16(5)12-8-11-15(4)10-7-9-14(2)3/h8,12-15H,6-7,9-11H2,1-5H3
49 atoms
O  4.138846 -1.36858 0.812296
O  3.519608 -2.755715 -0.821823
C  -3.910989 -0.460416 -0.197371
C  -3.205049 0.641784 -0.992638
C  -2.67784 1.813803 -0.172991
C  -1.971471 2.846641 -1.042761
C  -1.376273 4.030274 -0.279059
C  -2.987061 -1.128515 0.832826
C  -5.183197 0.035265 0.480144
C  -0.517118 4.882296 -1.205777
C  -2.451543 4.887244 0.380839
C  -1.763874 -1.709895 0.213924
C  -0.51129 -1.400697 0.567204
C  0.693116 -1.96397 -0.037447
C  0.508061 -2.935856 -1.158341
C  1.877874 -1.559486 0.472255
C  3.218976 -1.979183 0.062727
C  5.52073 -1.651829 0.549051
C  6.349654 -0.879121 1.543488
H  -4.20057 -1.233413 -0.918619
H  -3.902298 1.021607 -1.74707
H  -2.374232 0.200498 -1.553702
H  -1.975154 1.456261 0.587106
H  -3.502341 2.282667 0.37057
H  -1.168576 2.345017 -1.59472
H  -2.666816 3.226105 -1.801458
H  -0.727905 3.629257 0.509506
H  -3.550125 -1.934667 1.316563
H  -2.715855 -0.422034 1.621595
H  -4.970031 0.755528 1.27204
H  -5.848855 0.519704 -0.236649
H  -5.733683 -0.791329 0.932913
H  -1.115901 5.303345 -2.017332
H  0.285002 4.296291 -1.658419
H  -0.05577 5.715003 -0.671608
H  -3.141227 5.289392 -0.365975
H  -3.042114 4.327874 1.107359
H  -2.010408 5.734636 0.908978
H  -1.939471 -2.426402 -0.583661
H  -0.356312 -0.679702 1.36534
H  -0.068594 -3.797557 -0.817717
H  1.440065 -3.296074 -1.57332
H  -0.066991 -2.473762 -1.962253
H  1.855634 -0.845338 1.287418
H  5.768815 -1.358475 -0.473326
H  5.703673 -2.724096 0.64523
H  6.194088 0.19583 1.452073
H  6.13144 -1.177975 2.568859
H  7.404609 -1.079165 1.357517
elementType: O C H
totalener: -816.41611159 hartree
nucrepener: 1410.24921270 hartree
electener: -2226.66532429 hartree
oneelecener: -3905.81810871 hartree
twoeener: 1679.15278442 hartree
cpcmener: -0.02082312 hartree
kineticenergy: 812.45664857 hartree
xcener: -82.315779758464 hartree
chargesum: -0.0000000
charge: -0.292247 -0.515605 0.092490 -0.165518 -0.159894 -0.159066 0.079988 -0.152744 -0.336035 -0.299556 -0.306193 -0.117362 -0.162982 0.016291 -0.262476 -0.176149 0.482687 0.039556 -0.253973 0.054497 0.085539 0.079637 0.064337 0.082646 0.069618 0.066130 0.025925 0.099293 0.084962 0.082620 0.095518 0.096480 0.080891 0.088363 0.089680 0.082030 0.089134 0.091403 0.129354 0.117391 0.107860 0.106532 0.106293 0.116822 0.096618 0.094279 0.088222 0.087943 0.088770
qa: -0.2922 -0.5156 0.0925 -0.1655 -0.1599 -0.1591 0.0800 -0.1527 -0.3360 -0.2996 -0.3062 -0.1174 -0.1630 0.0163 -0.2625 -0.1761 0.4827 0.0396 -0.2540 0.0545 0.0855 0.0796 0.0643 0.0826 0.0696 0.0661 0.0259 0.0993 0.0850 0.0826 0.0955 0.0965 0.0809 0.0884 0.0897 0.0820 0.0891 0.0914 0.1294 0.1174 0.1079 0.1065 0.1063 0.1168 0.0966 0.0943 0.0882 0.0879 0.0888
va: 2.1155 1.9842 3.7768 3.8904 3.8716 3.8817 3.8084 3.9250 3.9518 3.9283 3.9275 3.8541 3.9027 3.7084 3.9189 3.7791 4.1384 3.8454 3.9709 1.0141 1.0084 1.0075 1.0079 1.0009 1.0125 1.0125 1.0185 1.0053 1.0042 0.9967 1.0025 1.0042 1.0029 1.0048 1.0049 1.0028 1.0028 1.0043 1.0011 1.0208 0.9955 1.0359 0.9966 1.0323 0.9955 0.9964 1.0031 1.0033 1.0064
dispcorr: -0.019408096 hartree
energy: -816.435519687418
dipole: -19.11339 18.16065 -0.95273 20.85538 -20.33462 0.52076 -0.56390 1.18706 0.62316
magnitude: 1.25189 au
magnitude: 3.18205 debye
