program: Orca
programVersion: 5.0.2
elementType: O O C C C C C C C C C C C C C C C C C H H H H H H H H H H H H H H H H H H H H H H H H H H H H H H
charge: 0
multiplicity: 1
keywords: wb97x-d3
keywords: def2-TZVPP
keywords: def2/J RIJCOSX
keywords: DEFGRID2
keywords: scfconv7
keywords: smallprint printgap noloewdin
keywords: NOSOSCF
formula: C17H30O2
InChI: InChI=1/C17H30O2/c1-6-19-17(18)13-16(5)12-8-11-15(4)10-7-9-14(2)3/h8,12-15H,6-7,9-11H2,1-5H3
49 atoms
O  4.039202 -1.200842 0.737413
O  3.45038 -2.722798 -0.784282
C  -3.953117 -0.463146 -0.245317
C  -3.180421 0.618776 -1.005855
C  -2.631715 1.759396 -0.155944
C  -1.802798 2.738605 -0.979218
C  -1.159364 3.868747 -0.174272
C  -3.08754 -1.177262 0.806349
C  -5.224117 0.074748 0.401074
C  -0.191966 4.659787 -1.046913
C  -2.198901 4.799021 0.44143
C  -1.853974 -1.771299 0.221553
C  -0.60886 -1.441984 0.582897
C  0.608736 -1.994281 -0.004593
C  0.447118 -3.018845 -1.08127
C  1.782873 -1.524812 0.472615
C  3.133331 -1.904176 0.055422
C  5.426654 -1.436231 0.453825
C  6.241859 -0.528305 1.33946
H  -4.250291 -1.216572 -0.983808
H  -3.836622 1.03378 -1.778108
H  -2.350259 0.149721 -1.544652
H  -2.00444 1.361705 0.648844
H  -3.456811 2.284013 0.3330
H  -1.012201 2.178254 -1.490979
H  -2.4245 3.17366 -1.771203
H  -0.583467 3.413845 0.640757
H  -3.689065 -1.978271 1.249889
H  -2.830953 -0.492442 1.618655
H  -5.004625 0.777067 1.207373
H  -5.848998 0.59372 -0.328124
H  -5.820038 -0.733838 0.828286
H  0.306448 5.448042 -0.479547
H  -0.714616 5.135637 -1.880566
H  0.583577 4.017404 -1.46853
H  -2.815455 5.26062 -0.33439
H  -2.867761 4.277841 1.127409
H  -1.723147 5.604021 1.004751
H  -2.013568 -2.504242 -0.564336
H  -0.471118 -0.700882 1.365697
H  -0.120119 -2.599198 -1.91388
H  -0.12808 -3.86811 -0.708867
H  1.387841 -3.390088 -1.466234
H  1.743038 -0.775442 1.25488
H  5.628344 -1.232034 -0.599807
H  5.669923 -2.483413 0.64586
H  6.068596 -0.731545 2.39625
H  7.299993 -0.694806 1.138808
H  6.028894 0.523072 1.146207
elementType: O C H
totalener: -816.41597744 hartree
nucrepener: 1419.62787773 hartree
electener: -2236.04385517 hartree
oneelecener: -3924.57740635 hartree
twoeener: 1688.53355118 hartree
cpcmener: -0.02080538 hartree
kineticenergy: 812.45713992 hartree
xcener: -82.316044218368 hartree
chargesum: 0.0000000
charge: -0.292529 -0.515814 0.090980 -0.164141 -0.166637 -0.157212 0.076326 -0.151396 -0.337144 -0.299075 -0.305710 -0.114236 -0.167865 0.018049 -0.263009 -0.176728 0.483898 0.039454 -0.254326 0.055334 0.087219 0.078503 0.065805 0.084304 0.069148 0.068123 0.026906 0.099518 0.084458 0.082797 0.095245 0.096909 0.089880 0.080154 0.088453 0.081792 0.089679 0.091662 0.129351 0.117735 0.106989 0.107370 0.106442 0.116885 0.095554 0.095694 0.088128 0.088731 0.088348
qa: -0.2925 -0.5158 0.0910 -0.1641 -0.1666 -0.1572 0.0763 -0.1514 -0.3371 -0.2991 -0.3057 -0.1142 -0.1679 0.0180 -0.2630 -0.1767 0.4839 0.0395 -0.2543 0.0553 0.0872 0.0785 0.0658 0.0843 0.0691 0.0681 0.0269 0.0995 0.0845 0.0828 0.0952 0.0969 0.0899 0.0802 0.0885 0.0818 0.0897 0.0917 0.1294 0.1177 0.1070 0.1074 0.1064 0.1169 0.0956 0.0957 0.0881 0.0887 0.0883
va: 2.1157 1.9838 3.7772 3.8880 3.8723 3.8750 3.8108 3.9260 3.9524 3.9296 3.9276 3.8496 3.9062 3.7035 3.9185 3.7797 4.1369 3.8449 3.9707 1.0140 1.0082 1.0075 1.0070 1.0012 1.0130 1.0123 1.0181 1.0059 1.0045 0.9965 1.0025 1.0041 1.0049 1.0031 1.0048 1.0029 1.0025 1.0042 1.0009 1.0203 0.9960 0.9961 1.0358 1.0323 0.9959 0.9959 1.0031 1.0064 1.0031
dispcorr: -0.019626914 hartree
energy: -816.435604355278
dipole: -18.08666 17.12205 -0.96462 20.59589 -20.03356 0.56233 -0.61199 1.17037 0.55839
magnitude: 1.24840 au
magnitude: 3.17318 debye
