program: Orca
programVersion: 5.0.2
elementType: O O C C C C C C C C C C C C C C C C C H H H H H H H H H H H H H H H H H H H H H H H H H H H H H H
charge: 0
multiplicity: 1
keywords: wb97x-d3
keywords: def2-TZVPP
keywords: def2/J RIJCOSX
keywords: DEFGRID2
keywords: scfconv7
keywords: smallprint printgap noloewdin
keywords: NOSOSCF
formula: C17H30O2
InChI: InChI=1/C17H30O2/c1-6-19-17(18)13-16(5)12-8-11-15(4)10-7-9-14(2)3/h8,12-15H,6-7,9-11H2,1-5H3
49 atoms
O  3.596187 -0.705635 1.227896
O  3.273977 -1.024009 -0.963213
C  -4.211758 -0.346077 0.146807
C  -3.459459 0.927591 0.553926
C  -2.510714 1.486276 -0.504546
C  -1.564072 2.533512 0.067986
C  -0.618106 3.175361 -0.947544
C  -3.41296 -1.61882 0.490583
C  -5.573473 -0.417683 0.828116
C  0.150592 4.32421 -0.304427
C  0.351321 2.161989 -1.547717
C  -2.081962 -1.68786 -0.171345
C  -0.911724 -1.579971 0.467942
C  0.390637 -1.517487 -0.187964
C  0.434224 -1.766789 -1.66296
C  1.448822 -1.200396 0.591965
C  2.832761 -0.986276 0.168143
C  4.996768 -0.465168 1.02658
C  5.789222 -1.751022 0.94407
H  -4.373974 -0.326062 -0.93747
H  -2.904189 0.729298 1.478752
H  -4.182124 1.708789 0.810168
H  -3.098673 1.925293 -1.317422
H  -1.933476 0.677701 -0.955917
H  -2.155577 3.320076 0.550231
H  -0.965619 2.075118 0.865369
H  -1.226162 3.588764 -1.761226
H  -4.005258 -2.48734 0.183792
H  -3.296059 -1.677265 1.577036
H  -5.467758 -0.405019 1.915753
H  -6.199809 0.431038 0.549235
H  -6.1111 -1.329311 0.560347
H  -0.524079 5.084595 0.094077
H  0.813135 4.813906 -1.020651
H  0.76906 3.967355 0.523318
H  0.937384 1.669876 -0.76596
H  -0.160269 1.384367 -2.116342
H  1.054727 2.646308 -2.227909
H  -2.099435 -1.787076 -1.252878
H  -0.913613 -1.460258 1.547811
H  -0.051918 -0.947013 -2.198118
H  -0.119758 -2.673744 -1.909307
H  1.439676 -1.868929 -2.051035
H  1.269038 -1.05947 1.65194
H  5.302817 0.114175 1.896536
H  5.154185 0.155909 0.143191
H  5.633919 -2.36982 1.828659
H  5.536262 -2.338455 0.061094
H  6.851553 -1.510528 0.888419
elementType: O C H
totalener: -816.41278869 hartree
nucrepener: 1483.86275495 hartree
electener: -2300.27554364 hartree
oneelecener: -4053.33685507 hartree
twoeener: 1753.06131143 hartree
cpcmener: -0.02077895 hartree
kineticenergy: 812.44403166 hartree
xcener: -82.313512626511 hartree
chargesum: -0.0000000
charge: -0.300335 -0.520065 0.082938 -0.188625 -0.125912 -0.173077 0.099513 -0.131604 -0.313036 -0.298531 -0.328551 -0.080116 -0.190689 0.008729 -0.270892 -0.195604 0.507110 0.039092 -0.255752 0.047564 0.069087 0.082611 0.077212 0.058668 0.076544 0.063095 0.026587 0.091145 0.080197 0.087673 0.089550 0.089836 0.087881 0.090155 0.081353 0.073871 0.096532 0.100009 0.132392 0.117234 0.109646 0.113120 0.110756 0.115251 0.109200 0.087507 0.088024 0.086799 0.095910
qa: -0.3003 -0.5201 0.0829 -0.1886 -0.1259 -0.1731 0.0995 -0.1316 -0.3130 -0.2985 -0.3286 -0.0801 -0.1907 0.0087 -0.2709 -0.1956 0.5071 0.0391 -0.2558 0.0476 0.0691 0.0826 0.0772 0.0587 0.0765 0.0631 0.0266 0.0911 0.0802 0.0877 0.0895 0.0898 0.0879 0.0902 0.0814 0.0739 0.0965 0.1000 0.1324 0.1172 0.1096 0.1131 0.1108 0.1153 0.1092 0.0875 0.0880 0.0868 0.0959
va: 2.1146 1.9663 3.7447 3.8962 3.8492 3.8805 3.7961 3.9417 3.9439 3.9313 3.9471 3.8364 3.8951 3.6679 3.9104 3.7682 4.1130 3.8472 3.9169 1.0209 1.0093 1.0064 1.0150 1.0130 1.0110 1.0125 1.0190 1.0077 1.0123 0.9996 1.0038 1.0043 1.0051 1.0052 1.0020 1.0024 0.9954 1.0074 0.9984 1.0217 0.9945 0.9988 1.0317 1.0338 0.9953 1.0127 1.0043 1.0136 1.0069
dispcorr: -0.022764446 hartree
energy: -816.435553133126
dipole: -13.92058 12.81762 -1.10296 11.30836 -11.28604 0.02231 -1.54726 2.10865 0.56139
magnitude: 1.23781 au
magnitude: 3.14626 debye
