program: Orca
programVersion: 5.0.2
elementType: O O C C C C C C C C C C C C C C C C C H H H H H H H H H H H H H H H H H H H H H H H H H H H H H H
charge: 0
multiplicity: 1
keywords: wb97x-d3
keywords: def2-TZVPP
keywords: def2/J RIJCOSX
keywords: DEFGRID2
keywords: scfconv7
keywords: smallprint printgap noloewdin
keywords: NOSOSCF
formula: C17H30O2
InChI: InChI=1/C17H30O2/c1-6-19-17(18)13-16(5)12-8-11-15(4)10-7-9-14(2)3/h8,12-15H,6-7,9-11H2,1-5H3
49 atoms
O  5.20949 -2.756496 -0.369154
O  4.447284 -2.909631 1.728872
C  -1.973784 1.058692 -0.164911
C  -3.196149 1.501866 -0.96965
C  -3.899535 2.742062 -0.428735
C  -5.167894 3.063616 -1.212223
C  -5.953355 4.291663 -0.738627
C  -1.471739 -0.297698 -0.684131
C  -0.859021 2.096917 -0.193566
C  -6.471893 4.132643 0.686643
C  -5.154232 5.582223 -0.883768
C  -0.401873 -0.882285 0.170949
C  0.822902 -1.207994 -0.25596
C  1.881712 -1.771818 0.577876
C  1.573678 -1.98434 2.02533
C  3.054287 -2.049725 -0.034398
C  4.266315 -2.609078 0.565903
C  6.472481 -3.322771 0.007065
C  6.430392 -4.832985 0.050215
H  -2.289568 0.918476 0.87655
H  -3.915416 0.675706 -0.993618
H  -2.897379 1.674409 -2.010456
H  -3.220443 3.598178 -0.458597
H  -4.141264 2.578475 0.626399
H  -4.904564 3.203281 -2.26657
H  -5.831698 2.192526 -1.181359
H  -6.825937 4.372969 -1.396391
H  -1.122362 -0.195119 -1.716004
H  -2.31889 -0.992705 -0.701987
H  -1.177346 3.048222 0.233794
H  0.01321 1.767018 0.373273
H  -0.531609 2.286128 -1.219371
H  -5.658666 4.112515 1.414787
H  -7.042966 3.209295 0.804095
H  -7.128134 4.961202 0.959281
H  -4.298681 5.60924 -0.205963
H  -4.774234 5.705224 -1.900067
H  -5.772438 6.452991 -0.657656
H  -0.669857 -1.03209 1.212931
H  1.070591 -1.04725 -1.301483
H  0.717669 -2.652853 2.13135
H  1.290157 -1.038403 2.489199
H  2.399872 -2.401043 2.585012
H  3.127565 -1.844091 -1.095814
H  6.806723 -2.907035 0.958582
H  7.164619 -2.984359 -0.762945
H  7.43029 -5.209198 0.269774
H  5.758751 -5.207404 0.821891
H  6.123229 -5.248246 -0.909769
elementType: O C H
totalener: -816.41465121 hartree
nucrepener: 1347.22097371 hartree
electener: -2163.63562491 hartree
oneelecener: -3779.79420995 hartree
twoeener: 1616.15858504 hartree
cpcmener: -0.02016893 hartree
kineticenergy: 812.45510955 hartree
xcener: -82.315533128721 hartree
chargesum: 0.0000000
charge: -0.299280 -0.516146 0.112965 -0.184058 -0.143284 -0.154914 0.073710 -0.103678 -0.341644 -0.317522 -0.319160 -0.157470 -0.144301 0.013090 -0.262892 -0.183025 0.492545 0.040909 -0.254690 0.042382 0.071333 0.070318 0.075622 0.069584 0.073817 0.074611 0.037809 0.079551 0.094252 0.097310 0.097691 0.085386 0.080781 0.092457 0.094121 0.079172 0.092700 0.094945 0.127300 0.115464 0.106620 0.106987 0.107035 0.116752 0.086029 0.108542 0.095449 0.086600 0.088227
qa: -0.2993 -0.5161 0.1130 -0.1841 -0.1433 -0.1549 0.0737 -0.1037 -0.3416 -0.3175 -0.3192 -0.1575 -0.1443 0.0131 -0.2629 -0.1830 0.4925 0.0409 -0.2547 0.0424 0.0713 0.0703 0.0756 0.0696 0.0738 0.0746 0.0378 0.0796 0.0943 0.0973 0.0977 0.0854 0.0808 0.0925 0.0941 0.0792 0.0927 0.0949 0.1273 0.1155 0.1066 0.1070 0.1070 0.1168 0.0860 0.1085 0.0954 0.0866 0.0882
va: 2.1137 1.9781 3.7439 3.9135 3.8740 3.8881 3.8231 3.9178 3.9514 3.9403 3.9422 3.8918 3.9166 3.7042 3.9207 3.7715 4.1437 3.8465 3.9176 1.0233 1.0125 1.0105 0.9995 1.0049 1.0095 1.0098 1.0108 1.0166 1.0060 1.0020 1.0024 1.0024 0.9978 1.0026 1.0041 0.9982 1.0025 1.0043 1.0037 1.0229 0.9959 0.9958 1.0357 1.0330 1.0131 0.9955 1.0071 1.0140 1.0042
dispcorr: -0.018779002 hartree
energy: -816.433430208451
dipole: -30.55833 29.63867 -0.91966 22.13317 -21.71738 0.41579 -2.91034 2.11021 -0.80013
magnitude: 1.28797 au
magnitude: 3.27376 debye
