program: Orca
programVersion: 5.0.2
elementType: O O C C C C C C C C C C C C C C C C C H H H H H H H H H H H H H H H H H H H H H H H H H H H H H H
charge: 0
multiplicity: 1
keywords: wb97x-d3
keywords: def2-TZVPP
keywords: def2/J RIJCOSX
keywords: DEFGRID2
keywords: scfconv7
keywords: smallprint printgap noloewdin
keywords: NOSOSCF
formula: C17H30O2
InChI: InChI=1/C17H30O2/c1-6-19-17(18)13-16(5)12-8-11-15(4)10-7-9-14(2)3/h8,12-15H,6-7,9-11H2,1-5H3
49 atoms
O  3.749696 -1.406476 1.224248
O  3.38147 -1.712071 -0.960398
C  -4.191284 -0.304349 0.086856
C  -3.562419 1.056127 0.410972
C  -2.453821 1.515808 -0.529956
C  -1.855603 2.853787 -0.112557
C  -0.636066 3.290746 -0.926983
C  -3.341935 -1.490172 0.579675
C  -5.583571 -0.400806 0.701919
C  -0.272004 4.734703 -0.600829
C  0.565405 2.380573 -0.688545
C  -2.028253 -1.630143 -0.10558
C  -0.839629 -1.629564 0.508105
C  0.449164 -1.697934 -0.17339
C  0.432224 -1.835065 -1.662261
C  1.553055 -1.592265 0.600048
C  2.950699 -1.583986 0.168149
C  5.165709 -1.320983 1.009476
C  5.593189 0.05255 0.544279
H  -4.294176 -0.39048 -1.001765
H  -3.184199 1.033703 1.440086
H  -4.351178 1.816254 0.403374
H  -2.852307 1.596238 -1.547002
H  -1.667059 0.762819 -0.572898
H  -2.629698 3.625913 -0.182377
H  -1.569691 2.810342 0.945601
H  -0.89954 3.239127 -1.990394
H  -3.915231 -2.407196 0.4005
H  -3.201331 -1.412882 1.66213
H  -5.540591 -0.295506 1.788702
H  -6.23748 0.385268 0.321354
H  -6.05568 -1.360004 0.481983
H  -1.100318 5.413996 -0.811092
H  0.588091 5.07356 -1.181551
H  -0.017426 4.844058 0.456659
H  1.430464 2.709704 -1.267381
H  0.854413 2.388036 0.3660
H  0.368736 1.343538 -0.966754
H  -2.076405 -1.725148 -1.186725
H  -0.80771 -1.525805 1.588999
H  -0.150416 -2.709995 -1.954832
H  1.418436 -1.925582 -2.098454
H  -0.059596 -0.96881 -2.110106
H  1.407583 -1.481745 1.668479
H  5.492597 -2.09584 0.314556
H  5.602378 -1.544547 1.981426
H  5.213161 0.292883 -0.447844
H  5.264591 0.826021 1.238642
H  6.682161 0.088237 0.499255
elementType: O C H
totalener: -816.41288595 hartree
nucrepener: 1464.46915765 hartree
electener: -2280.88204360 hartree
oneelecener: -4014.44305800 hartree
twoeener: 1733.56101440 hartree
cpcmener: -0.02048213 hartree
kineticenergy: 812.45751262 hartree
xcener: -82.316193040779 hartree
chargesum: 0.0000000
charge: -0.299539 -0.517252 0.088969 -0.193168 -0.056302 -0.171817 0.083872 -0.119810 -0.306864 -0.297857 -0.285981 -0.112023 -0.159954 -0.009921 -0.261688 -0.183173 0.500846 0.039031 -0.255864 0.040526 0.067920 0.075792 0.067248 0.004942 0.072202 0.064015 0.024407 0.094038 0.080766 0.086380 0.089357 0.090221 0.087215 0.089828 0.081078 0.094762 0.083792 0.065175 0.133067 0.114020 0.113094 0.110646 0.106208 0.114765 0.086945 0.109104 0.087028 0.088056 0.095901
qa: -0.2995 -0.5173 0.0890 -0.1932 -0.0563 -0.1718 0.0839 -0.1198 -0.3069 -0.2979 -0.2860 -0.1120 -0.1600 -0.0099 -0.2617 -0.1832 0.5008 0.0390 -0.2559 0.0405 0.0679 0.0758 0.0672 0.0049 0.0722 0.0640 0.0244 0.0940 0.0808 0.0864 0.0894 0.0902 0.0872 0.0898 0.0811 0.0948 0.0838 0.0652 0.1331 0.1140 0.1131 0.1106 0.1062 0.1148 0.0869 0.1091 0.0870 0.0881 0.0959
va: 2.1126 1.9762 3.7550 3.9282 3.8336 3.9087 3.8219 3.9229 3.9330 3.9266 3.9336 3.8713 3.8934 3.6868 3.9065 3.7547 4.1337 3.8484 3.9151 1.0226 1.0086 1.0066 1.0171 1.0486 1.0111 1.0113 1.0176 1.0052 1.0145 1.0001 1.0046 1.0046 1.0052 1.0050 1.0027 1.0063 1.0042 1.0045 1.0014 1.0227 0.9975 1.0359 0.9913 1.0341 1.0122 0.9956 1.0146 1.0044 1.0069
dispcorr: -0.021643311 hartree
energy: -816.434529266249
dipole: -15.27267 14.16185 -1.11082 17.48918 -17.23468 0.25450 -1.66516 2.20589 0.54074
magnitude: 1.26138 au
magnitude: 3.20618 debye
