program: Orca
programVersion: 5.0.2
elementType: O O C C C C C C C C C C C C C C C C C H H H H H H H H H H H H H H H H H H H H H H H H H H H H H H
charge: 0
multiplicity: 1
keywords: wb97x-d3
keywords: def2-TZVPP
keywords: def2/J RIJCOSX
keywords: DEFGRID2
keywords: scfconv7
keywords: smallprint printgap noloewdin
keywords: NOSOSCF
formula: C17H30O2
InChI: InChI=1/C17H30O2/c1-6-19-17(18)13-16(5)12-8-11-15(4)10-7-9-14(2)3/h8,12-15H,6-7,9-11H2,1-5H3
49 atoms
O  3.913985 -0.935471 0.674798
O  3.348484 -2.497059 -0.815661
C  -4.093953 -0.481442 -0.097285
C  -3.341849 0.546071 -0.947963
C  -2.69517 1.694779 -0.181065
C  -1.879075 2.602124 -1.093947
C  -1.196796 3.778447 -0.393968
C  -3.190586 -1.158294 0.948088
C  -5.319363 0.116138 0.582514
C  -0.142387 3.316128 0.606407
C  -0.574824 4.718097 -1.420684
C  -1.96169 -1.746717 0.347075
C  -0.717619 -1.369633 0.662298
C  0.502067 -1.893935 0.055383
C  0.349765 -2.957932 -0.983535
C  1.668195 -1.357101 0.47794
C  3.020349 -1.681963 0.023173
C  5.302115 -1.117731 0.358827
C  6.102418 -0.192727 1.240242
H  -4.440526 -1.264815 -0.780872
H  -4.034871 0.955143 -1.690651
H  -2.565555 0.030159 -1.523202
H  -2.051529 1.294105 0.606301
H  -3.460781 2.289869 0.326813
H  -1.114372 2.00582 -1.606687
H  -2.53488 2.990507 -1.881061
H  -1.965235 4.336785 0.154361
H  -3.769653 -1.953605 1.429598
H  -2.921712 -0.448075 1.734206
H  -5.043415 0.873216 1.318767
H  -5.983508 0.587908 -0.14404
H  -5.894516 -0.651145 1.103989
H  -0.565796 2.709539 1.408005
H  0.356171 4.166447 1.075429
H  0.626717 2.716234 0.112175
H  0.19788 4.20703 -2.000619
H  -1.320142 5.093111 -2.124612
H  -0.10854 5.581773 -0.942979
H  -2.123219 -2.508569 -0.410603
H  -0.583386 -0.59978 1.41748
H  -0.23946 -2.58016 -1.821182
H  -0.199992 -3.806711 -0.574014
H  1.292911 -3.320891 -1.370892
H  1.61877 -0.587028 1.239464
H  5.472928 -0.891918 -0.695883
H  5.587767 -2.1576 0.530637
H  5.847647 0.852945 1.067247
H  5.958121 -0.417178 2.297164
H  7.161449 -0.317742 1.016056
elementType: O C H
totalener: -816.41577816 hartree
nucrepener: 1440.67995977 hartree
electener: -2257.09573793 hartree
oneelecener: -3966.72226478 hartree
twoeener: 1709.62652686 hartree
cpcmener: -0.02084537 hartree
kineticenergy: 812.46016642 hartree
xcener: -82.316990528602 hartree
chargesum: 0.0000000
charge: -0.292504 -0.515823 0.085585 -0.161742 -0.154153 -0.159806 0.084959 -0.146295 -0.334720 -0.311292 -0.299015 -0.110547 -0.175687 0.028326 -0.264422 -0.178973 0.483237 0.039169 -0.254524 0.055486 0.087157 0.077442 0.057588 0.078765 0.065911 0.070788 0.024195 0.099435 0.081587 0.084337 0.094355 0.095504 0.091172 0.093764 0.082002 0.081222 0.087882 0.089074 0.130459 0.116724 0.108212 0.106907 0.105933 0.115602 0.096728 0.094820 0.088557 0.087988 0.088632
qa: -0.2925 -0.5158 0.0856 -0.1617 -0.1542 -0.1598 0.0850 -0.1463 -0.3347 -0.3113 -0.2990 -0.1105 -0.1757 0.0283 -0.2644 -0.1790 0.4832 0.0392 -0.2545 0.0555 0.0872 0.0774 0.0576 0.0788 0.0659 0.0708 0.0242 0.0994 0.0816 0.0843 0.0944 0.0955 0.0912 0.0938 0.0820 0.0812 0.0879 0.0891 0.1305 0.1167 0.1082 0.1069 0.1059 0.1156 0.0967 0.0948 0.0886 0.0880 0.0886
va: 2.1154 1.9840 3.7927 3.8876 3.8694 3.8768 3.8054 3.9246 3.9509 3.9280 3.9293 3.8455 3.9050 3.6771 3.9196 3.7743 4.1377 3.8449 3.9710 1.0135 1.0084 1.0074 1.0048 1.0098 1.0130 1.0120 1.0188 1.0068 1.0047 0.9965 1.0030 1.0033 1.0008 1.0052 1.0030 1.0027 1.0047 1.0054 1.0003 1.0200 0.9958 0.9963 1.0356 1.0331 0.9955 0.9962 1.0031 1.0032 1.0065
dispcorr: -0.020395578 hartree
energy: -816.436173738780
dipole: -15.77587 14.73699 -1.03888 18.13627 -17.55118 0.58509 -0.60355 1.17596 0.57240
magnitude: 1.32259 au
magnitude: 3.36176 debye
