program: Orca
programVersion: 5.0.2
elementType: O O C C C C C C C C C C C C C C C C C H H H H H H H H H H H H H H H H H H H H H H H H H H H H H H
charge: 0
multiplicity: 1
keywords: wb97x-d3
keywords: def2-TZVPP
keywords: def2/J RIJCOSX
keywords: DEFGRID2
keywords: scfconv7
keywords: smallprint printgap noloewdin
keywords: NOSOSCF
formula: C17H30O2
InChI: InChI=1/C17H30O2/c1-6-19-17(18)13-16(5)12-8-11-15(4)10-7-9-14(2)3/h8,12-15H,6-7,9-11H2,1-5H3
49 atoms
O  3.51211 -0.543647 1.18299
O  3.242097 -1.031289 -0.983495
C  -4.212624 -0.326823 0.161144
C  -3.405527 0.903004 0.599441
C  -2.478838 1.476667 -0.471702
C  -1.400321 2.372414 0.121832
C  -0.497106 3.070646 -0.894917
C  -3.453613 -1.634622 0.463212
C  -5.573284 -0.370138 0.84549
C  0.463956 4.017625 -0.185133
C  0.279436 2.079933 -1.756151
C  -2.125379 -1.713671 -0.204857
C  -0.955838 -1.581223 0.4311
C  0.346993 -1.510897 -0.223315
C  0.398891 -1.790905 -1.691137
C  1.393642 -1.148508 0.552174
C  2.777157 -0.923828 0.133912
C  4.910387 -0.285261 0.993362
C  5.731855 -1.552962 1.032054
H  -4.379223 -0.269625 -0.921127
H  -2.820686 0.642013 1.48987
H  -4.089232 1.693727 0.92352
H  -3.07438 2.039923 -1.198363
H  -2.013097 0.666015 -1.035339
H  -1.875661 3.133358 0.751572
H  -0.775594 1.772701 0.796756
H  -1.134991 3.668098 -1.557622
H  -4.071053 -2.47732 0.136152
H  -3.332827 -1.724188 1.54706
H  -6.167247 0.510962 0.597317
H  -6.146156 -1.25043 0.547738
H  -5.46611 -0.398635 1.932592
H  -0.070105 4.758956 0.412707
H  1.092929 4.557945 -0.895177
H  1.127023 3.468759 0.488635
H  0.930672 2.599928 -2.461654
H  0.913478 1.435625 -1.139756
H  -0.377835 1.434846 -2.340694
H  -2.143059 -1.832328 -1.284279
H  -0.961652 -1.442705 1.508707
H  -0.128533 -2.718149 -1.917899
H  1.406916 -1.871102 -2.077774
H  -0.11135 -0.997235 -2.242067
H  1.20103 -0.97529 1.604611
H  5.182752 0.369614 1.820019
H  5.074887 0.26698 0.067012
H  5.582358 -2.094193 1.96656
H  5.501987 -2.222032 0.20328
H  6.789002 -1.293523 0.964847
elementType: O C H
totalener: -816.41244912 hartree
nucrepener: 1494.92422037 hartree
electener: -2311.33666949 hartree
oneelecener: -4075.43625760 hartree
twoeener: 1764.09958810 hartree
cpcmener: -0.02046567 hartree
kineticenergy: 812.45283791 hartree
xcener: -82.315655163652 hartree
chargesum: -0.0000000
charge: -0.300262 -0.520721 0.079417 -0.191476 -0.123540 -0.189218 0.108852 -0.130938 -0.313151 -0.301926 -0.315441 -0.076952 -0.198493 0.008067 -0.268796 -0.194252 0.511479 0.039757 -0.255071 0.048994 0.069673 0.083636 0.080982 0.065782 0.080793 0.059512 0.024552 0.090230 0.080485 0.089544 0.089827 0.087589 0.088208 0.090366 0.081786 0.101645 0.058892 0.095879 0.132822 0.118340 0.114168 0.110896 0.106696 0.115010 0.108871 0.087041 0.087870 0.087011 0.095567
qa: -0.3003 -0.5207 0.0794 -0.1915 -0.1235 -0.1892 0.1089 -0.1309 -0.3132 -0.3019 -0.3154 -0.0770 -0.1985 0.0081 -0.2688 -0.1943 0.5115 0.0398 -0.2551 0.0490 0.0697 0.0836 0.0810 0.0658 0.0808 0.0595 0.0246 0.0902 0.0805 0.0895 0.0898 0.0876 0.0882 0.0904 0.0818 0.1016 0.0589 0.0959 0.1328 0.1183 0.1142 0.1109 0.1067 0.1150 0.1089 0.0870 0.0879 0.0870 0.0956
va: 2.1148 1.9672 3.7453 3.8910 3.8374 3.8910 3.7874 3.9397 3.9462 3.9338 3.9396 3.8218 3.8999 3.6486 3.9077 3.7588 4.1081 3.8468 3.9184 1.0208 1.0096 1.0066 1.0133 1.0074 1.0115 1.0106 1.0195 1.0083 1.0122 1.0035 1.0044 0.9996 1.0051 1.0051 1.0017 1.0084 1.0097 0.9967 0.9981 1.0210 0.9993 1.0332 0.9949 1.0347 0.9955 1.0127 1.0044 1.0133 1.0070
dispcorr: -0.023328251 hartree
energy: -816.435777371348
dipole: -13.34130 12.21763 -1.12367 10.79155 -10.69678 0.09477 -1.30752 1.87699 0.56947
magnitude: 1.26330 au
magnitude: 3.21104 debye
